{"text_format":"1","workbook":"xlsx","n_sheets":10,"sheets":["表紙","基礎情報","水温①","水温②","水温③","マップ","申告書","申告内容","海域リスト","市区町村"],"not_rendered":{"charts":0,"images":14,"macros":1,"external_links":0,"defined_names":7,"comments":0,"pivot_tables":0},"unopened":[],"bounds":{"document_bytes":16777216,"sheet_cells":100000,"rows_first":2000,"rows_last":500,"rows_between":2000,"halvings":0,"cell_chars":16384,"cell_head_chars":4096},"cells_cut":0,"cells_raw":0,"read":"whole","date_system":"1900"}

{"sheet":"表紙","index":0,"n_rows":67,"n_cols":12,"rows_kept":67,"cut":false,"hidden":false,"merged":[[9,4,9,47],[10,5,10,10],[10,11,10,46],[11,5,11,10],[13,5,13,10],[12,5,12,10],[11,11,11,46],[12,11,12,46],[13,11,13,46]]}
[]
[]
[null,"　「救命いかだ等の搭載を要しない方法」の申告書作成ツール"]
[null,null,"■救命いかだ等の義務化について"]
[]
[null,null,null,"義務化の詳細は国土交通省ＨＰをご覧ください。"]
[]
[]
[null,null,"●","義務化の対象船舶"]
[null,null,null,null,"以下の①又は②に該当する船舶のうち、一定の水温を下回る水域（海域を含む）を航行する船舶が救命いかだ等の義務化の対象になります。\n①旅客定員13人以上の船舶\n②旅客定員12人以下の船舶（事業の用に供するもの）"]
[null,null,null,null,null,"航行する水域の水温",null,null,null,null,null,"対象船舶※１"]
[null,null,null,null,null,"10℃未満",null,null,null,null,null,"すべての船舶　（河川、港内、一部の湖を航行するものを除く※２）"]
[null,null,null,null,null,"10℃以上15℃未満",null,null,null,null,null,"平水区域を超えて航行する船舶"]
[null,null,null,null,null,"15℃以上20℃未満",null,null,null,null,null,"平水区域を超えて航行する船舶（船内に浸水しない構造を有するものまたは母港から５海里以内のみを航行するものを除く）"]
[null,null,null,null,null,"※１ 船舶検査証書の航行区域で判断"]
[null,null,null,null,null,"※２ 琵琶湖、霞ヶ浦、サロマ湖、猪苗代湖、中海、屈斜路湖、宍道湖又は支笏湖が対象であり、それ以外の湖を航行する船舶は非対象"]
[]
[]
[null,null,"●","水温の確認方法"]
[null,null,null,null,"ご自身が航行する水域の水温は、国土交通省が公表している海域早見図で確認することができます。"]
{"$rows_left_out":48}
{"sheet":"基礎情報","index":1,"n_rows":63,"n_cols":67,"rows_kept":63,"cut":false,"hidden":false,"merged":[[47,4,49,16],[48,17,48,20],[48,21,48,24],[48,25,48,28],[43,25,43,28],[44,25,44,28],[43,7,43,16],[44,7,44,16],[45,7,45,16],[46,7,46,16],[44,17,44,20],[49,17,49,20],[43,17,43,20],[47,17,47,20],[49,21,49,24],[49,25,49,28],[40,4,41,6],[42,7,42,16],[23,4,23,13],[46,21,46,24],[46,25,46,28],[42,17,42,20],[46,4,46,6],[43,4,43,6],[44,4,44,6],[45,4,45,6],[42,4,42,6],[41,17,41,20],[40,7,41,16],[44,21,44,24],[43,21,43,24],[40,17,40,28],[47,21,47,24],[47,25,47,28],[45,41,45,44],[42,21,42,24],[42,25,42,28],[44,33,44,36],[46,41,46,44],[44,37,44,40],[46,37,46,40],[45,21,45,24],[45,25,45,28],[44,41,44,44],[45,37,45,40],[43,41,43,44],[46,29,46,32],[46,33,46,36],[6,4,6,48],[26,9,26,13],[28,9,28,13],[29,9,29,13],[20,4,20,5],[20,7,20,9],[12,4,12,6],[9,4,9,48],[12,8,12,10],[26,31,26,35],[27,9,27,13],[27,31,27,35],[28,31,28,35],[29,31,29,35],[12,12,12,14],[17,4,17,28],[40,52,40,54],[45,33,45,36],[42,37,42,40],[43,37,43,40],[41,21,41,24],[41,25,41,28],[41,33,41,36],[41,29,41,32],[42,33,42,36],[43,33,43,36],[46,17,46,20],[40,29,40,36],[40,37,40,44],[42,29,42,32],[43,29,43,32],[44,29,44,32],[45,29,45,32],[41,41,41,44],[42,41,42,44],[41,37,41,40],[45,17,45,20],[62,4,62,17],[61,4,61,17],[60,4,60,17],[56,36,56,44],[56,18,56,26],[56,27,56,35],[58,4,58,17],[59,4,59,17],[57,18,57,26],[57,27,57,35],[57,36,57,44]]}
[]
[null,null,null,null,null,null,null,null,null,null,null,null,null,null,null,null,null,null,null,null,null,null,null,null,null,null,null,null,null,null,null,null,null,null,null,null,null,null,null,null,null,null,null,null,null,null,null,null,null,"基礎情報"]
[null,"　「救命いかだ等の搭載を要しない方法」の申告書作成ツール"]
[null,null,"■船舶所有者情報"]
[]
[null,null,"●","船舶検査証書に記載の船舶所有者氏名又は名称"]
[null,null,null,null,"所有者氏名又は名称を入力してください"]
[]
[null,null,"●","現住所（住居）"]
[null,null,null,null,"例）東京都千代田区九段北 4－1－3 飛栄九段北ビル5階"]
[]
[null,null,"●","電話番号（自宅 or 携帯）"]
[null,null,null,null,"XXX",null,null,"-","XXXX",null,null,"-","XXXX"]
[]
[null,null,"A 本船(申告する者が所有する船舶)の基本情報"]
[]
[null,null,"●","船名"]
[null,null,null,null,"船名を入力してください"]
[]
[null,null,"●","船舶番号"]
{"$rows_left_out":44}
{"sheet":"水温①","index":2,"n_rows":78,"n_cols":44,"rows_kept":78,"cut":false,"hidden":true,"merged":[[27,4,27,12],[27,13,27,21],[27,22,27,30],[27,31,27,39],[27,40,27,48],[17,4,17,48],[26,13,26,21],[26,22,26,30],[26,31,26,39],[26,40,26,48],[21,4,21,48],[28,34,28,36],[28,40,28,41],[28,43,28,45],[29,4,29,12],[29,13,29,21],[29,22,29,30],[29,31,29,39],[29,40,29,48],[28,4,28,12],[28,13,28,14],[28,16,28,18],[28,22,28,23],[28,25,28,27],[28,31,28,32],[44,4,44,48],[30,4,30,12],[30,13,30,21],[30,22,30,30],[30,31,30,39],[30,40,30,48],[74,4,74,28],[71,4,71,9],[71,12,71,20],[54,4,54,12],[54,13,54,21],[53,4,53,12],[53,13,53,21],[49,13,49,21],[50,4,50,12],[50,13,50,21],[51,4,51,12],[51,13,51,14],[51,16,51,18],[52,4,52,12],[52,13,52,21]]}
[]
[]
[null,null,"■水温①（航行する水域に水温10℃未満となる水域が含まれる時期）の詳細情報"]
[]
[null,null,"●","特例① 一定の水温を下回る時期に航行しない船舶"]
[]
[null,null,null,"●",{"$f":"\"営業船が、\"&基礎情報!S58&\"の期間において航行時に講じる安全対策（特例②、③、④、⑤のいずれかの特例を講じて航行する場合は除く）\"","v":"営業船が、12/13～3/20の期間において航行時に講じる安全対策（特例②、③、④、⑤のいずれかの特例を講じて航行する場合は除く）"}]
[null,null,null,null,false,"救命いかだ等の搭載が必要となる水域を航行しない。"]
[null,null,null,null,false,"水温10℃以上となる平水区域以外を航行しない。"]
[]
[]
[]
[null,null,"●","特例② 伴走船と共に航行する船舶"]
[]
[null,null,null,"●",{"$f":"\"営業船が、\"&基礎情報!S58&\"の期間において伴走船を伴い航行する際の遵守事項\"","v":"営業船が、12/13～3/20の期間において伴走船を伴い航行する際の遵守事項"}]
[null,null,null,null,"【遵守事項】"]
[null,null,null,null,{"$f":"\"営業船（\"&基礎情報!E18&\"、船舶番号\"&基礎情報!E21&\"-\"&基礎情報!H21&\"）は、海域\"&oTEXTJOIN(\",\",TRUE,基礎情報!E43,基礎情報!E44,基礎情報!E45,基礎情報!E46,基礎情報!E47)&\"（\"&基礎情報!E24&\"）を航行する際、別表（伴走船）に掲げる船舶（以下「伴走船」という。）と共に航行する。\"","v":"営業船（船名を入力してください、船舶番号XXX-XXXXX）は、海域6（選択してください）を航行する際、別表（伴走船）に掲げる船舶（以下「伴走船」という。）と共に航行する。"}]
[null,null,null,null,"\n営業船の船舶所有者の責任において、伴走船には下記の事項を遵守させる。"]
[null,null,null,null,"・３隻以内の伴走船と共に航行すること"]
[null,null,null,null,"・伴走船の搭載人員は、別表の搭載可能人員を超えることなく、営業船の搭載人員分を搭載（救助）できるようにすること"]
{"$rows_left_out":59}
{"sheet":"水温②","index":3,"n_rows":78,"n_cols":44,"rows_kept":78,"cut":false,"hidden":true,"merged":[[17,4,17,48],[53,4,53,12],[53,13,53,21],[49,13,49,21],[50,4,50,12],[50,13,50,21],[51,4,51,12],[51,13,51,14],[51,16,51,18],[52,4,52,12],[52,13,52,21],[30,4,30,12],[30,13,30,21],[30,22,30,30],[30,31,30,39],[30,40,30,48],[74,4,74,28],[71,4,71,9],[71,12,71,20],[54,4,54,12],[54,13,54,21],[28,31,28,32],[28,34,28,36],[28,40,28,41],[28,43,28,45],[29,4,29,12],[29,13,29,21],[29,22,29,30],[29,31,29,39],[29,40,29,48],[21,4,21,48],[44,4,44,48],[26,13,26,21],[26,22,26,30],[26,31,26,39],[26,40,26,48],[27,4,27,12],[27,13,27,21],[27,22,27,30],[27,31,27,39],[27,40,27,48],[28,4,28,12],[28,13,28,14],[28,16,28,18],[28,22,28,23],[28,25,28,27]]}
[]
[]
[null,null,"■水温②（航行する水域に水温10℃以上15℃未満となる水域が含まれる時期（水温①の時期を除く。））の詳細情報"]
[]
[null,null,"●","特例① 一定の水温を下回る時期に航行しない船舶"]
[]
[null,null,null,"●",{"$f":"\"営業船が、\"&基礎情報!AB58&\"の期間において航行時に講じる安全対策（特例②、③、④、⑤のいずれかの特例を講じて航行する場合は除く）\"","v":"営業船が、該当期間なしの期間において航行時に講じる安全対策（特例②、③、④、⑤のいずれかの特例を講じて航行する場合は除く）"}]
[null,null,null,null,false,"救命いかだ等の搭載が必要となる水域を航行しない。"]
[null,null,null,null,false,"平水区域以外を航行しない。"]
[]
[]
[]
[null,null,"●","特例② 伴走船と共に航行する船舶"]
[]
[null,null,null,"●",{"$f":"\"営業船が、\"&基礎情報!AB58&\"の期間において伴走船を伴い航行する際の遵守事項\"","v":"営業船が、該当期間なしの期間において伴走船を伴い航行する際の遵守事項"}]
[null,null,null,null,"【遵守事項】"]
[null,null,null,null,{"$f":"\"営業船（\"&基礎情報!E18&\"、船舶番号\"&基礎情報!E21&\"-\"&基礎情報!H21&\"）は、海域\"&oTEXTJOIN(\",\",TRUE,基礎情報!E43,基礎情報!E44,基礎情報!E45,基礎情報!E46,基礎情報!E47)&\"（\"&基礎情報!E24&\"）を航行する際、別表（伴走船）に掲げる船舶（以下「伴走船」という。）と共に航行する。\"","v":"営業船（船名を入力してください、船舶番号XXX-XXXXX）は、海域6（選択してください）を航行する際、別表（伴走船）に掲げる船舶（以下「伴走船」という。）と共に航行する。"}]
[null,null,null,null,"\n営業船の船舶所有者の責任において、伴走船には下記の事項を遵守させる。"]
[null,null,null,null,"・３隻以内の伴走船と共に航行すること"]
[null,null,null,null,"・伴走船の搭載人員は、別表の搭載可能人員を超えることなく、営業船の搭載人員分を搭載（救助）できるようにすること"]
{"$rows_left_out":59}
{"sheet":"水温③","index":4,"n_rows":76,"n_cols":44,"rows_kept":76,"cut":false,"hidden":true,"merged":[[17,4,17,48],[53,4,53,12],[53,13,53,21],[49,13,49,21],[50,4,50,12],[50,13,50,21],[51,4,51,12],[51,13,51,14],[51,16,51,18],[52,4,52,12],[52,13,52,21],[30,4,30,12],[30,13,30,21],[30,22,30,30],[30,31,30,39],[30,40,30,48],[74,4,74,28],[71,4,71,9],[71,12,71,20],[54,4,54,12],[54,13,54,21],[28,31,28,32],[28,34,28,36],[28,40,28,41],[28,43,28,45],[29,4,29,12],[29,13,29,21],[29,22,29,30],[29,31,29,39],[29,40,29,48],[21,4,21,48],[44,4,44,48],[26,13,26,21],[26,22,26,30],[26,31,26,39],[26,40,26,48],[27,4,27,12],[27,13,27,21],[27,22,27,30],[27,31,27,39],[27,40,27,48],[28,4,28,12],[28,13,28,14],[28,16,28,18],[28,22,28,23],[28,25,28,27]]}
[]
[]
[null,null,"■水温③（航行する水域に水温15℃以上20℃未満となる水域が含まれる時期（水温①、水温②の時期を除く。））の詳細情報"]
[]
[null,null,"●","特例① 一定の水温を下回る時期に航行しない船舶"]
[]
[null,null,null,"●",{"$f":"\"営業船が、\"&基礎情報!AK58&\"の期間において航行時に講じる安全対策（特例②、③、④、⑤のいずれかの特例を講じて航行する場合は除く）\"","v":"営業船が、該当期間なしの期間において航行時に講じる安全対策（特例②、③、④、⑤のいずれかの特例を講じて航行する場合は除く）"}]
[null,null,null,null,false,"救命いかだ等の搭載が必要となる水域を航行しない。"]
[null,null,null,null,false,"平水区域以外を航行しない。"]
[]
[]
[]
[null,null,"●","特例② 伴走船と共に航行する船舶"]
[]
[null,null,null,"●",{"$f":"\"営業船が、\"&基礎情報!AK58&\"の期間において伴走船を伴い航行する際の遵守事項\"","v":"営業船が、該当期間なしの期間において伴走船を伴い航行する際の遵守事項"}]
[null,null,null,null,"【遵守事項】"]
[null,null,null,null,{"$f":"\"営業船（\"&基礎情報!E18&\"、船舶番号\"&基礎情報!E21&\"-\"&基礎情報!H21&\"）は、海域\"&oTEXTJOIN(\",\",TRUE,基礎情報!E43,基礎情報!E44,基礎情報!E45,基礎情報!E46,基礎情報!E47)&\"（\"&基礎情報!E24&\"）を航行する際、別表（伴走船）に掲げる船舶（以下「伴走船」という。）と共に航行する。\"","v":"営業船（船名を入力してください、船舶番号XXX-XXXXX）は、海域6（選択してください）を航行する際、別表（伴走船）に掲げる船舶（以下「伴走船」という。）と共に航行する。"}]
[null,null,null,null,"\n営業船の船舶所有者の責任において、伴走船には下記の事項を遵守させる。"]
[null,null,null,null,"・３隻以内の伴走船と共に航行すること"]
[null,null,null,null,"・伴走船の搭載人員は、別表の搭載可能人員を超えることなく、営業船の搭載人員分を搭載（救助）できるようにすること"]
{"$rows_left_out":57}
{"sheet":"マップ","index":5,"n_rows":1,"n_cols":2,"rows_kept":1,"cut":false,"hidden":true,"merged":[[4,1,77,75],[3,14,3,25],[3,26,3,43],[3,44,3,59],[3,60,3,72],[1,14,1,25],[1,26,1,43],[1,44,1,59],[1,60,1,72],[2,14,2,25],[2,26,2,43],[2,44,2,59],[2,60,2,72]]}
[null,"※全島表示しておりません。対象箇所がない場合、別途問い合わせください。"]

{"sheet":"申告書","index":6,"n_rows":162,"n_cols":10,"rows_kept":162,"cut":false,"hidden":false,"merged":[[86,1,86,3],[86,4,86,9],[104,1,104,3],[104,4,104,9],[136,1,136,3],[136,4,136,9],[151,1,151,3],[151,4,151,9],[72,6,72,7],[72,8,72,9],[73,1,73,3],[73,4,73,5],[73,6,73,7],[73,8,73,9],[74,1,74,3],[74,4,74,5],[74,6,74,7],[74,8,74,9],[90,1,90,3],[90,4,90,5],[90,6,90,7],[90,8,90,9],[91,1,91,3],[91,4,91,5],[18,1,18,2],[5,5,5,6],[6,5,6,6],[7,5,7,6],[8,5,8,6],[10,1,10,9],[13,1,13,2],[14,1,14,2],[15,1,15,2],[16,1,17,2],[6,7,6,9],[7,7,7,9],[91,6,91,7],[91,8,91,9],[89,1,89,3],[89,4,89,5],[89,6,89,7],[89,8,89,9],[96,1,96,3],[96,4,96,9],[92,1,92,3],[92,4,92,5],[92,6,92,7],[92,8,92,9],[93,1,93,3],[93,4,93,5],[93,6,93,7],[93,8,93,9],[109,1,109,3],[109,4,109,5],[109,6,109,7],[109,8,109,9],[107,1,107,3],[107,4,107,5],[107,6,107,7],[107,8,107,9],[97,1,97,3],[98,1,98,3],[98,4,98,9],[97,4,97,9],[108,1,108,3],[108,4,108,5],[108,6,108,7],[108,8,108,9],[161,1,161,3],[161,4,161,9],[116,4,116,9],[115,4,115,9],[114,1,114,3],[114,4,114,9],[110,1,110,3],[110,4,110,5],[110,6,110,7],[110,8,110,9],[111,1,111,3],[111,4,111,5],[111,6,111,7],[111,8,111,9],[153,1,153,9],[154,1,154,3],[154,4,154,9],[146,1,146,3],[146,4,146,9],[158,1,158,3],[158,4,158,9],[155,1,155,3],[155,4,155,9],[156,1,156,3],[156,4,156,9],[157,1,157,3],[157,4,157,9],[138,1,138,9],[139,4,139,9],[140,1,140,3],[140,4,140,9],[139,1,139,3],[141,1,141,3],[141,4,141,9],[142,1,142,3],[142,4,142,9],[143,1,143,3],[143,4,143,9],[131,4,131,9],[128,1,128,3],[128,4,128,9],[131,1,131,3],[115,1,115,3],[116,1,116,3],[123,1,123,9],[124,1,124,3],[124,4,124,9],[125,1,125,3],[125,4,125,9],[126,1,126,3],[126,4,126,9],[127,1,127,3],[127,4,127,9],[121,1,121,3],[121,4,121,9],[21,1,21,9],[35,1,35,9],[43,1,43,9],[50,1,50,9],[57,1,57,9],[80,4,80,9],[79,4,79,9],[78,4,78,9],[44,1,48,9],[51,1,55,9],[58,1,62,9],[71,1,71,3],[71,4,71,5],[71,6,71,7],[71,8,71,9],[72,1,72,3],[78,1,78,3],[75,1,75,3],[75,4,75,5],[75,6,75,7],[75,8,75,9],[79,1,79,3],[80,1,80,3],[72,4,72,5],[68,1,68,3],[68,4,68,9],[26,7,26,9],[24,7,24,9],[23,7,23,9],[40,7,40,9],[38,7,38,9],[37,7,37,9],[33,7,33,9],[31,7,31,9],[30,7,30,9],[28,1,28,9]]}
[]
[]
[null,"位置保持型膨脹式救命いかだ等の搭載を要しない方法を利用するための申告書"]
[]
[null,"　　　　　　　殿"]
[null,null,null,null,null,"提出日",null,"西暦　 　　　年　　　月 　　日"]
[null,null,null,null,null,"住所",null,{"$f":"IF(基礎情報!E10<>\"\",基礎情報!E10,\"\")","v":"例）東京都千代田区九段北 4－1－3 飛栄九段北ビル5階"}]
[null,null,null,null,null,"船舶所有者\n氏名又は名称",null,{"$f":"IF(基礎情報!E7<>\"\",基礎情報!E7,\"\")","v":"所有者氏名又は名称を入力してください"}]
[null,null,null,null,null,"電話番号",null,{"$f":"IF(基礎情報!E13<>\"\",基礎情報!E13,\"\")&\"-\"&IF(基礎情報!I13<>\"\",基礎情報!I13,\"\")&\"-\"&IF(基礎情報!M13<>\"\",基礎情報!M13,\"\")","v":"XXX-XXXX-XXXX"}]
[]
[null,"　救命設備規則第57条第３項、第58条第１項、第69条第２項又は第69条の２第１項（総トン数20トン未満の小型船舶にあっては小型船舶安全規則第58条第３項）に規定する水温その他航海の態様を次のとおり申告します。\n　なお、本申告書の記載事項に変更が生じた場合は、最寄りの検査機関に改めて本様式により申告書を提出します。"]
[]
[null,"１　所有者の船舶情報（本船）"]
[null,"船名",null,{"$f":"基礎情報!E18","v":"船名を入力してください"}]
[null,"船舶番号",null,{"$f":"基礎情報!E21&\"-\"&基礎情報!H21","v":"XXX-XXXXX"}]
[null,"航行区域",null,{"$f":"IF(基礎情報!E24=\"平水区域\",\"☑\",\"□\")&\"平水区域　　　　　　\"&IF(基礎情報!E24=\"沿海区域\",\"☑\",\"□\")&\"沿海区域\"","v":"□平水区域　　　　　　□沿海区域"}]
[null,"最大搭載人員",null,"計",{"$f":"SUM(F18,H18,J18)","v":0}]
[null,null,null,"（内訳）","旅客",{"$f":"oIFS(基礎情報!E24=\"平水区域\",基礎情報!J27,基礎情報!E24=\"沿海区域\",基礎情報!AF27,基礎情報!E24=\"選択してください\",\"\")","v":""},"船員",{"$f":"oIFS(基礎情報!E24=\"平水区域\",基礎情報!J28,基礎情報!E24=\"沿海区域\",基礎情報!AF28,基礎情報!E24=\"選択してください\",\"\")","v":""},"その他\n乗船者",{"$f":"oIFS(基礎情報!E24=\"平水区域\",基礎情報!J29,基礎情報!E24=\"沿海区域\",基礎情報!AF29,基礎情報!E24=\"選択してください\",\"\")","v":""}]
[null,"船内に浸水しない\n構造の要件",null,{"$f":"IF(基礎情報!E33,\"☑\",\"□\") & 基礎情報!F33 &\"　　\"&IF(基礎情報!E34,\"☑\",\"□\") & 基礎情報!F34","v":"□水密全通甲板を有する船舶　　□不沈性及び安定性を有する船舶"}]
[]
{"$rows_left_out":143}
{"sheet":"申告内容","index":7,"n_rows":24,"n_cols":27,"rows_kept":24,"cut":false,"hidden":true,"merged":[]}
["入力シート情報：本船",{"$f":"\"本船（\"&基礎情報!E18&\"、船舶番号\"&基礎情報!E21&\"-\"&基礎情報!H21&\"）\"","v":"本船（船名を入力してください、船舶番号XXX-XXXXX）"}]
["入力シート情報：航行区域",{"$f":"IF(基礎情報!E43<>\"\",基礎情報!E43,\"【未入力】\")&IF(基礎情報!E44<>\"\",\"、\"&基礎情報!E44,\"\")&IF(基礎情報!E45<>\"\",\"、\"&基礎情報!E45,\"\")&IF(基礎情報!E46<>\"\",\"、\"&基礎情報!E46,\"\")&IF(基礎情報!E47<>\"\",\"、\"&基礎情報!E47,\"\")","v":"6"}]
["入力シート情報：水域",{"$f":"基礎情報!E24","v":"選択してください"}]
["水温帯：母港",{"$f":"水温①!E75&\"（\"&水温①!E72&水温①!M72&\"）\"","v":"営業船の母港を入力してください（選択してください選択してください）"},{"$f":"水温②!E75&\"（\"&水温②!E72&水温②!M72&\"）\"","v":"営業船の母港を入力してください（選択してください選択してください）"},{"$f":"水温③!E75&\"（\"&水温③!E72&水温③!M72&\"）\"","v":"営業船の母港を入力してください（選択してください選択してください）"}]
["文末",{"$f":"IF(B10=\"TRUE,FALSE,FALSE,FALSE,FALSE\",\"\",\"\")&\nIF(水温①!E8=TRUE,\"当該水域のうち救命いかだ等の搭載が必要となる区域では\",\"\")&\nIF(水温①!E9=TRUE,\"当該水域のうち水温が10℃未満となる平水区域、沿海区域では\",\"\")&\nIF(E5>=13,\"旅客を搭載して航行しない。\",\"\")&\n IF(E5<=12,\"事業（海上運送法における人の運送を行う事業や遊漁船業）の用に供しない。\",\"\")","v":"事業（海上運送法における人の運送を行う事業や遊漁船業）の用に供しない。"},{"$f":"IF(C10=\"TRUE,FALSE,FALSE,FALSE,FALSE\",\"\",\"\")&\nIF(水温②!E8=TRUE,\"当該水域のうち救命いかだ等の搭載が必要となる区域では\",\"\")&\nIF(水温②!E9=TRUE,\"当該水域のうち沿海区域では\",\"\")&\nIF(E5>=13,\"旅客を搭載して航行しない。\",\"\")&\n IF(E5<=12,\"事業（海上運送法における人の運送を行う事業や遊漁船業）の用に供しない。\",\"\")","v":"事業（海上運送法における人の運送を行う事業や遊漁船業）の用に供しない。"},{"$f":"IF(D10=\"TRUE,FALSE,FALSE,FALSE,FALSE\",\"\",\"\")&\nIF(水温③!E8=TRUE,\"当該水域のうち救命いかだ等の搭載が必要となる区域では\",\"\")&\nIF(水温③!E9=TRUE,\"当該水域のうち沿海区域では\",\"\")&\nIF(E5>=13,\"旅客を搭載して航行しない。\",\"\")&\n IF(E5<=12,\"事業（海上運送法における人の運送を行う事業や遊漁船業）の用に供しない。\",\"\")","v":"事業（海上運送法における人の運送を行う事業や遊漁船業）の用に供しない。"},{"$f":"IF(基礎情報!E24=\"平水区域\",基礎情報!J30,0)+IF(基礎情報!E24=\"沿海区域\",基礎情報!AF30,0)","v":0}]
["対象列番号",{"$f":"MATCH(B10,E10:AA10,0)+COLUMN(D10)","v":{"$error":"#N/A"}},{"$f":"MATCH(C10,E10:AA10,0)+COLUMN(D10)","v":{"$error":"#N/A"}},{"$f":"MATCH(D10,E10:AA10,0)+COLUMN(D10)","v":{"$error":"#N/A"}}]
["【申告内容】",{"$f":"IFERROR(INDIRECT(ADDRESS(22,申告内容!B6,,,\"申告内容\")),B1&\"は、旅客を搭載して、水域\"&B2&\"（\"&B3&\"）を航行しない。\")","v":"本船（船名を入力してください、船舶番号XXX-XXXXX）は、旅客を搭載して、水域6（選択してください）を航行しない。"},{"$f":"IFERROR(INDIRECT(ADDRESS(23,申告内容!C6,,,\"申告内容\")),B1&\"は、旅客を搭載して、水域\"&B2&\"（\"&B3&\"）を航行しない。\")","v":"本船（船名を入力してください、船舶番号XXX-XXXXX）は、旅客を搭載して、水域6（選択してください）を航行しない。"},{"$f":"IFERROR(INDIRECT(ADDRESS(24,申告内容!D6,,,\"申告内容\")),B1&\"は、旅客を搭載して、水域\"&B2&\"（\"&B3&\"）を航行しない。\")","v":"本船（船名を入力してください、船舶番号XXX-XXXXX）は、旅客を搭載して、水域6（選択してください）を航行しない。"}]
["対象列番号",null,null,null,5,6,7,8,9,10,11,12,13,14,15,16,17,18,19,20,21,22,23,24,25,26,27]
[null,"水温①","水温②","水温③","特例①","特例②","特例③","特例④","特例⑤","特例①、特例②、特例③","特例②、特例③","特例①、特例③","特例①、特例②","特例①、特例②、特例③、特例⑤","特例②、特例③、特例⑤","特例①、特例③、特例⑤","特例①、特例⑤","特例③、特例⑤","特例①、特例②、特例⑤","特例②、特例⑤","特例①、特例②、特例③、特例④","特例②、特例③、特例④","特例①、特例③、特例④","特例①、特例④","特例③、特例④","特例①、特例②、特例④","特例②、特例④"]
["ALL",{"$f":"oTEXTJOIN(\",\",TRUE,B11:B15)","v":"False,False,False,False,False"},{"$f":"oTEXTJOIN(\",\",TRUE,C11:C15)","v":"False,False,False,False,False"},{"$f":"oTEXTJOIN(\",\",TRUE,D11:D15)","v":"False,False,False,False,False"},{"$f":"oTEXTJOIN(\",\",TRUE,E11:E15)","v":"True,False,False,False,False"},{"$f":"oTEXTJOIN(\",\",TRUE,F11:F15)","v":"False,True,False,False,False"},{"$f":"oTEXTJOIN(\",\",TRUE,G11:G15)","v":"False,False,True,False,False"},{"$f":"oTEXTJOIN(\",\",TRUE,H11:H15)","v":"False,False,False,True,False"},{"$f":"oTEXTJOIN(\",\",TRUE,I11:I15)","v":"False,False,False,False,True"},{"$f":"oTEXTJOIN(\",\",TRUE,J11:J15)","v":"True,True,True,False,False"},{"$f":"oTEXTJOIN(\",\",TRUE,K11:K15)","v":"False,True,True,False,False"},{"$f":"oTEXTJOIN(\",\",TRUE,L11:L15)","v":"True,False,True,False,False"},{"$f":"oTEXTJOIN(\",\",TRUE,M11:M15)","v":"True,True,False,False,False"},{"$f":"oTEXTJOIN(\",\",TRUE,N11:N15)","v":"True,True,True,False,True"},{"$f":"oTEXTJOIN(\",\",TRUE,O11:O15)","v":"False,True,True,False,True"},{"$f":"oTEXTJOIN(\",\",TRUE,P11:P15)","v":"True,False,True,False,True"},{"$f":"oTEXTJOIN(\",\",TRUE,Q11:Q15)","v":"True,False,False,False,True"},{"$f":"oTEXTJOIN(\",\",TRUE,R11:R15)","v":"False,False,True,False,True"},{"$f":"oTEXTJOIN(\",\",TRUE,S11:S15)","v":"True,True,False,False,True"},{"$f":"oTEXTJOIN(\",\",TRUE,T11:T15)","v":"False,True,False,False,True"},{"$f":"oTEXTJOIN(\",\",TRUE,U11:U15)","v":"True,True,True,True,False"},{"$f":"oTEXTJOIN(\",\",TRUE,V11:V15)","v":"False,True,True,True,False"},{"$f":"oTEXTJOIN(\",\",TRUE,W11:W15)","v":"True,False,True,True,False"},{"$f":"oTEXTJOIN(\",\",TRUE,X11:X15)","v":"True,False,False,True,False"},{"$f":"oTEXTJOIN(\",\",TRUE,Y11:Y15)","v":"False,False,True,True,False"},{"$f":"oTEXTJOIN(\",\",TRUE,Z11:Z15)","v":"True,True,False,True,False"},{"$f":"oTEXTJOIN(\",\",TRUE,AA11:AA15)","v":"False,True,False,True,False"}]
["特例①　一定の水温を下回る時期に航行しない",{"$f":"OR(水温①!E8,水温①!E9)","v":false},{"$f":"OR(水温②!E8,水温②!E9)","v":false},{"$f":"OR(水温③!E8,水温③!E9)","v":false},{"$f":"NOT(ISBLANK(E17))","v":true},{"$f":"NOT(ISBLANK(F17))","v":false},false,false,false,true,false,true,true,true,false,true,true,false,true,false,true,false,true,true,false,true,false]
["特例②　必ず航行時に伴走船を伴う",{"$f":"基礎情報!W60","v":false},{"$f":"基礎情報!AF60","v":false},{"$f":"基礎情報!AO60","v":false},{"$f":"NOT(ISBLANK(E18))","v":false},true,false,false,false,true,true,false,true,true,true,false,false,false,true,true,true,true,false,false,false,true,true]
["特例③　救助船を配備している",{"$f":"基礎情報!W61","v":false},{"$f":"基礎情報!AF61","v":false},{"$f":"基礎情報!AO61","v":false},false,false,true,false,false,true,true,true,false,true,true,true,false,true,false,false,true,true,true,false,true,false,false]
["特例④　船内に浸水しない構造を有する",{"$f":"水温①!E63","v":false},{"$f":"水温②!E63","v":false},{"$f":"水温③!E63","v":false},false,false,false,true,false,false,false,false,false,false,false,false,false,false,false,false,true,true,true,true,true,true,true]
["特例⑤　母港から５海里を超えて航行しない",{"$f":"基礎情報!W63","v":false},{"$f":"基礎情報!AF63","v":false},{"$f":"基礎情報!AO63","v":false},false,false,false,false,true,false,false,false,false,true,true,true,true,true,true,true,false,false,false,false,false,false,false]
["パターン分け"]
["特例①　一定の水温を下回る時期に航行しない",null,null,null,"❶",null,null,null,null,"❸",null,"❷","❷","❹",null,"❸","❷",null,"❸",null,"❹",null,"❸","❷",null,"❸"]
["特例②　必ず航行時に伴走船を伴う",null,null,null,null,"❶",null,null,null,"❷","❷",null,"❶","❸","❸",null,null,null,"❷","❷","❸","❸",null,null,null,"❷","❷"]
["特例③　救助船を配備している",null,null,null,null,null,"❶",null,null,"❶","❶","❶",null,"❷","❷","❷",null,"❷",null,null,"❷","❷","❷",null,"❷"]
["特例④　船内に浸水しない構造を有する",null,null,null,null,null,null,"❶",null,null,null,null,null,null,null,null,null,null,null,null,"❶","❶","❶","❶","❶","❶","❶"]
{"$rows_left_out":5}
{"sheet":"海域リスト","index":8,"n_rows":130,"n_cols":14,"rows_kept":130,"cut":false,"hidden":true,"merged":[[1,2,2,2],[1,3,1,6],[1,7,1,8],[1,9,1,10]]}
[]
[null,null,"海域名","水温",null,null,null,"南北",null,"東西",null,"10℃未満"]
[null,null,null,"10℃未満","15℃未満","20℃未満","20℃以上","北端","南端","東端","西端"]
[null,"XXX","","","","","","","","",""]
[null,1,"サロマ湖","11/6~5/11","-","-","-","-","-","-","-",{"$f":"IFERROR(LEFT(D5,FIND(\"~\",D5)-1),\"\")","v":"11/6"},{"$f":"IFERROR(RIGHT(D5,LEN(D5)-FIND(\"~\",D5)),\"\")","v":"5/11"}]
[null,2,"屈斜路湖","11/15~5/16","-","-","-","-","-","-","-",{"$f":"IFERROR(LEFT(D6,FIND(\"~\",D6)-1),\"\")","v":"11/15"},{"$f":"IFERROR(RIGHT(D6,LEN(D6)-FIND(\"~\",D6)),\"\")","v":"5/16"}]
[null,3,"支笏湖","11/19~5/23","-","-","-","-","-","-","-","11/19","5/23"]
[null,4,"猪苗代湖","11/29~4/28","-","-","-","-","-","-","-","11/29","4/28"]
[null,5,"霞ヶ浦","12/10~3/19","-","-","-","-","-","-","-","12/10","3/19"]
[null,6,"中海","12/13~3/20","-","-","-","-","-","-","-","12/13","3/20"]
[null,7,"宍道湖","12/13~3/19","-","-","-","-","-","-","-","12/13","3/19"]
[null,8,"琵琶湖","1/4~3/24","-","-","-","-","-","-","-","1/4","3/24"]
[null,101,"宗谷地方オホーツク海沿岸","10/28~6/15","10/2~7/16","4/1~3/31","なし","北緯45.75度","北緯45.5度","東経142.25度","東経142度","10/28","6/15","通年は4/1~3/31"]
[null,102,"紋別地方沿岸","10/28~6/15","10/1~7/19","4/1~3/31","なし","北緯44.75度","北緯44.5度","東経143.25度","東経143度","10/28","6/15"]
[null,103,"網走地方沿岸","10/30~6/18","9/28~7/22","4/1~3/31","なし","北緯44.25度","北緯44度","東経144.25度","東経144度","10/30","6/18"]
[null,104,"知床岬の東","11/4~6/25","9/28~7/31","4/1~3/31","なし","北緯44.5度","北緯44.25度","東経145.5度","東経145.25度","11/4","6/25"]
[null,105,"根室海峡","11/13~6/21","10/7~7/29","4/1~3/31","なし","北緯44度","北緯43.75度","東経145.25度","東経145度","11/13","6/21"]
[null,106,"宗谷地方日本海沿岸","11/23~5/31","10/20~7/2","9/13~8/9","左記期間以外","北緯45.25度","北緯45度","東経140.75度","東経140.5度","11/23","5/31"]
[null,107,"留萌地方沿岸北部","12/1~5/24","10/25~6/25","9/21~7/31","左記期間以外","北緯44.75度","北緯44.5度","東経141度","東経140.75度","12/1","5/24"]
[null,108,"留萌地方沿岸南部","12/4~5/19","10/28~6/20","9/23~7/27","左記期間以外","北緯44.5度","北緯44.25度","東経141度","東経140.75度","12/4","5/19"]
{"$rows_left_out":111}
{"sheet":"市区町村","index":9,"n_rows":1893,"n_cols":9,"rows_kept":1893,"cut":false,"hidden":true,"merged":[]}
["都道府県",null,"都道府県","市区町村","都道府県（ﾌﾘｶﾞﾅ）","市区町村（ﾌﾘｶﾞﾅ）"]
["選択してください",null,"北海道","札幌市中央区","ﾎｯｶｲﾄﾞｳ","ｻｯﾎﾟﾛｼﾁｭｳｵｳｸ",{"$f":"IFERROR(INDIRECT(ADDRESS(MATCH(水温①!E$72,C$2:C$1893,0)+ROW()-1,4)&\":D\"&MATCH(水温①!E$72,C$2:C$1893,0)+COUNTIF(C2:C1893,水温①!E$72)),\"選択してください\")","v":"選択してください"},{"$f":"IFERROR(INDIRECT(ADDRESS(MATCH(水温②!E$72,C$2:C$1893,0)+ROW()-1,4)&\":D\"&MATCH(水温②!E$72,C$2:C$1893,0)+COUNTIF(C2:C1893,水温②!E$72)),\"選択してください\")","v":"選択してください"},{"$f":"IFERROR(INDIRECT(ADDRESS(MATCH(水温③!E$72,C$2:C$1893,0)+ROW()-1,4)&\":D\"&MATCH(水温③!E$72,C$2:C$1893,0)+COUNTIF(C2:C1893,水温③!E$72)),\"選択してください\")","v":"選択してください"}]
["北海道",null,"北海道","札幌市北区","ﾎｯｶｲﾄﾞｳ","ｻｯﾎﾟﾛｼｷﾀｸ"]
["青森県",null,"北海道","札幌市東区","ﾎｯｶｲﾄﾞｳ","ｻｯﾎﾟﾛｼﾋｶﾞｼｸ"]
["岩手県",null,"北海道","札幌市白石区","ﾎｯｶｲﾄﾞｳ","ｻｯﾎﾟﾛｼｼﾛｲｼｸ"]
["宮城県",null,"北海道","札幌市豊平区","ﾎｯｶｲﾄﾞｳ","ｻｯﾎﾟﾛｼﾄﾖﾋﾗｸ"]
["秋田県",null,"北海道","札幌市南区","ﾎｯｶｲﾄﾞｳ","ｻｯﾎﾟﾛｼﾐﾅﾐｸ"]
["山形県",null,"北海道","札幌市西区","ﾎｯｶｲﾄﾞｳ","ｻｯﾎﾟﾛｼﾆｼｸ"]
["福島県",null,"北海道","札幌市厚別区","ﾎｯｶｲﾄﾞｳ","ｻｯﾎﾟﾛｼｱﾂﾍﾞﾂｸ"]
["茨城県",null,"北海道","札幌市手稲区","ﾎｯｶｲﾄﾞｳ","ｻｯﾎﾟﾛｼﾃｲﾈｸ"]
["栃木県",null,"北海道","札幌市清田区","ﾎｯｶｲﾄﾞｳ","ｻｯﾎﾟﾛｼｷﾖﾀｸ"]
["群馬県",null,"北海道","函館市","ﾎｯｶｲﾄﾞｳ","ﾊｺﾀﾞﾃｼ"]
["埼玉県",null,"北海道","小樽市","ﾎｯｶｲﾄﾞｳ","ｵﾀﾙｼ"]
["千葉県",null,"北海道","旭川市","ﾎｯｶｲﾄﾞｳ","ｱｻﾋｶﾜｼ"]
["東京都",null,"北海道","室蘭市","ﾎｯｶｲﾄﾞｳ","ﾑﾛﾗﾝｼ"]
["神奈川県",null,"北海道","釧路市","ﾎｯｶｲﾄﾞｳ","ｸｼﾛｼ"]
["新潟県",null,"北海道","帯広市","ﾎｯｶｲﾄﾞｳ","ｵﾋﾞﾋﾛｼ"]
["富山県",null,"北海道","北見市","ﾎｯｶｲﾄﾞｳ","ｷﾀﾐｼ"]
["石川県",null,"北海道","夕張市","ﾎｯｶｲﾄﾞｳ","ﾕｳﾊﾞﾘｼ"]
["福井県",null,"北海道","岩見沢市","ﾎｯｶｲﾄﾞｳ","ｲﾜﾐｻﾞﾜｼ"]
{"$rows_left_out":1873}