{"text_format":"1","workbook":"xlsx","n_sheets":10,"sheets":["表紙","基礎情報","水温①","水温②","水温③","マップ","申告書","申告内容","海域リスト","市区町村"],"not_rendered":{"charts":0,"images":14,"macros":1,"external_links":0,"defined_names":7,"comments":0,"pivot_tables":0},"unopened":[],"bounds":{"document_bytes":16777216,"sheet_cells":100000,"rows_first":2000,"rows_last":500,"rows_between":2000,"halvings":0,"cell_chars":16384,"cell_head_chars":4096},"cells_cut":0,"cells_raw":0,"read":"whole","date_system":"1900"}

{"sheet":"表紙","index":0,"n_rows":67,"n_cols":12,"rows_kept":67,"cut":false,"hidden":false,"merged":[[9,4,9,47],[10,5,10,10],[10,11,10,46],[11,5,11,10],[13,5,13,10],[12,5,12,10],[11,11,11,46],[12,11,12,46],[13,11,13,46]]}
[]
[]
[null,"　「救命いかだ等の搭載を要しない方法」の申告書作成ツール"]
[null,null,"■救命いかだ等の義務化について"]
[]
[null,null,null,"義務化の詳細は国土交通省ＨＰをご覧ください。"]
[]
[]
[null,null,"●","義務化の対象船舶"]
[null,null,null,null,"以下の①又は②に該当する船舶のうち、一定の水温を下回る水域（海域を含む）を航行する船舶が救命いかだ等の義務化の対象になります。\n①旅客定員13人以上の船舶\n②旅客定員12人以下の船舶（事業の用に供するもの）"]
[null,null,null,null,null,"航行する水域の水温",null,null,null,null,null,"対象船舶※１"]
[null,null,null,null,null,"10℃未満",null,null,null,null,null,"すべての船舶　（河川、港内、一部の湖を航行するものを除く※２）"]
[null,null,null,null,null,"10℃以上15℃未満",null,null,null,null,null,"平水区域を超えて航行する船舶"]
[null,null,null,null,null,"15℃以上20℃未満",null,null,null,null,null,"平水区域を超えて航行する船舶（船内に浸水しない構造を有するものまたは母港から５海里以内のみを航行するものを除く）"]
[null,null,null,null,null,"※１ 船舶検査証書の航行区域で判断"]
[null,null,null,null,null,"※２ 琵琶湖、霞ヶ浦、サロマ湖、猪苗代湖、中海、屈斜路湖、宍道湖又は支笏湖が対象であり、それ以外の湖を航行する船舶は非対象"]
[]
[]
[null,null,"●","水温の確認方法"]
[null,null,null,null,"ご自身が航行する水域の水温は、国土交通省が公表している海域早見図で確認することができます。"]
[null,null,null,null,"海域早見図は国土交通省HPで公表されています。"]
[]
[null,null,"●","義務化に対して必要な措置"]
[null,null,null,null,"義務化の対象船舶は以下のいずれかを実施する必要があります。"]
[null,null,null,null,"Ａ）救命いかだ等の搭載　又は"]
[null,null,null,null,"Ｂ）救命いかだ等の搭載を要しない方法"]
[]
[null,null,null,null,"Ａ）救命いかだ等の搭載"]
[null,null,null,null,"乗り移り時の落水危険性を軽減させた救命いかだ又は内部収容型救命浮器（救命いかだ等）を搭載する必要があります。"]
[null,null,null,null,"なお、水面から乗り込み場所までの高さが1.2m以上の場合、スライダー等の搭載が必要になります。"]
[]
[null,null,null,null,"Ｂ）救命いかだ等の搭載を要しない方法"]
[null,null,null,null,"方法①～⑤のいずれか単一の方法又は複数の方法を組み合わせて実施する必要があります。"]
[null,null,null,null,"ただし、これらの方法を適用する場合には船舶検査時等に検査機関に申告書を提出する必要があります。"]
[null,null,null,null,"方法①　一定の水温を上回る時期のみの航行"]
[null,null,null,null,null,"概要：一定の水温を上回る時期のみを航行する場合や、"]
[null,null,null,null,null,"　　　水温10℃以上の時期には航行区域を平水区域に制限することで救命いかだ等の搭載が不要となります。"]
[null,null,null,null,"方法②　伴走船と航行"]
[null,null,null,null,null,"概要：出航から帰港まで営業船を視認し、早急に救助できる位置を伴走船が航行することで救命いかだ等の搭載が不要となります。"]
[null,null,null,null,null,"　　　その際、予め検査機関に提出した航行上の条件に記載の伴走船（営業船を含め最大４隻まで）と航行する必要があります。"]
[null,null,null,null,"方法③　救助船を配備"]
[null,null,null,null,null,"概要：事故通報後、一定の時間内に現場到着できる救助船を港や海上に配備することで救命いかだ等の搭載が不要となります。"]
[null,null,null,null,"方法④　船内に浸水しない構造（水温15℃以上の水域に限定）"]
[null,null,null,null,null,"概要：水密全通甲板又は不沈性・安定性を有する構造の船舶は、水温15℃以上の水域を航行する場合に救命いかだ等の搭載が不要となります。"]
[null,null,null,null,"方法⑤　母港から５海里以内の航行（水温15℃以上の水域に限定）"]
[null,null,null,null,null,"概要：航行区域を母港からの航行距離が５海里を越えない範囲に制限することで"]
[null,null,null,null,null,"　　　水温15℃以上の水域を航行する場合に救命いかだ等の搭載が不要となります。"]
[null,null,null,null,null,"【方法②及び③の特例】船舶毎に設定された通常時の最大搭載人員に関わらず、検査機関が船舶の復原性及び要救助者の搭載場所を確認すること"]
[null,null,null,null,null,"で、緊急時のみに搭載できる人数を別枠として予め決定することができます。別枠は「要救助者を搭載する枠」として取り扱い可能。"]
[]
[]
[null,null,"■本ツールについて"]
[]
[null,null,"●","本ツールの目的"]
[null,null,null,null,"本ツールは、義務化に対して必要な措置のうち「救命いかだ等の搭載を要しない方法」を実施する際に必要となる申告書の作成を補助するツールです。"]
[null,null,null,null,"申告書はこのツールでの作成が必須ではありませんが、船舶所有者様の負担を軽減することを目的に作成したツールになりますので、"]
[null,null,null,null,"積極的に活用ください。"]
[null,null,null,null,"なお、このツールは想定されるおおよその船舶の態様に対応できるよう設計しておりますが、"]
[null,null,null,null,"場合によってはこのツールで対応できない場合がございます。その場合は検査機関にご相談ください。"]
[null,null,null,null,"また、申告内容の相談は、最寄りの検査機関までお問合せください。"]
[null,null,null,null,"なお、本ツールは申告書の作成補助を目的としたものですので、"]
[null,null,null,null,"本ツールで作成した申告書であっても誤入力等により修正を求められる場合があります。"]
[]
[null,null,"●","本ツールの使用方法"]
[null,null,null,null,"右下のボタンを押して頂くとツールの入力画面に移動します。入力画面に必要な情報を入力してください。"]
[null,null,null,null,"入力方法に不明な点がございましたら、操作手順書を別途用意しているので、そちらをご確認ください。"]
[null,null,null,null,"入力が完了し確定ボタンを押して頂くと申告書の出力画面に移動しますので、その画面を印刷し検査機関にご提出ください。"]

{"sheet":"基礎情報","index":1,"n_rows":63,"n_cols":67,"rows_kept":63,"cut":false,"hidden":false,"merged":[[47,4,49,16],[48,17,48,20],[48,21,48,24],[48,25,48,28],[43,25,43,28],[44,25,44,28],[43,7,43,16],[44,7,44,16],[45,7,45,16],[46,7,46,16],[44,17,44,20],[49,17,49,20],[43,17,43,20],[47,17,47,20],[49,21,49,24],[49,25,49,28],[40,4,41,6],[42,7,42,16],[23,4,23,13],[46,21,46,24],[46,25,46,28],[42,17,42,20],[46,4,46,6],[43,4,43,6],[44,4,44,6],[45,4,45,6],[42,4,42,6],[41,17,41,20],[40,7,41,16],[44,21,44,24],[43,21,43,24],[40,17,40,28],[47,21,47,24],[47,25,47,28],[45,41,45,44],[42,21,42,24],[42,25,42,28],[44,33,44,36],[46,41,46,44],[44,37,44,40],[46,37,46,40],[45,21,45,24],[45,25,45,28],[44,41,44,44],[45,37,45,40],[43,41,43,44],[46,29,46,32],[46,33,46,36],[6,4,6,48],[26,9,26,13],[28,9,28,13],[29,9,29,13],[20,4,20,5],[20,7,20,9],[12,4,12,6],[9,4,9,48],[12,8,12,10],[26,31,26,35],[27,9,27,13],[27,31,27,35],[28,31,28,35],[29,31,29,35],[12,12,12,14],[17,4,17,28],[40,52,40,54],[45,33,45,36],[42,37,42,40],[43,37,43,40],[41,21,41,24],[41,25,41,28],[41,33,41,36],[41,29,41,32],[42,33,42,36],[43,33,43,36],[46,17,46,20],[40,29,40,36],[40,37,40,44],[42,29,42,32],[43,29,43,32],[44,29,44,32],[45,29,45,32],[41,41,41,44],[42,41,42,44],[41,37,41,40],[45,17,45,20],[62,4,62,17],[61,4,61,17],[60,4,60,17],[56,36,56,44],[56,18,56,26],[56,27,56,35],[58,4,58,17],[59,4,59,17],[57,18,57,26],[57,27,57,35],[57,36,57,44]]}
[]
[null,null,null,null,null,null,null,null,null,null,null,null,null,null,null,null,null,null,null,null,null,null,null,null,null,null,null,null,null,null,null,null,null,null,null,null,null,null,null,null,null,null,null,null,null,null,null,null,null,"基礎情報"]
[null,"　「救命いかだ等の搭載を要しない方法」の申告書作成ツール"]
[null,null,"■船舶所有者情報"]
[]
[null,null,"●","船舶検査証書に記載の船舶所有者氏名又は名称"]
[null,null,null,null,"所有者氏名又は名称を入力してください"]
[]
[null,null,"●","現住所（住居）"]
[null,null,null,null,"例）東京都千代田区九段北 4－1－3 飛栄九段北ビル5階"]
[]
[null,null,"●","電話番号（自宅 or 携帯）"]
[null,null,null,null,"XXX",null,null,"-","XXXX",null,null,"-","XXXX"]
[]
[null,null,"A 本船(申告する者が所有する船舶)の基本情報"]
[]
[null,null,"●","船名"]
[null,null,null,null,"船名を入力してください"]
[]
[null,null,"●","船舶番号"]
[null,null,null,null,"XXX",null,"-","XXXXX",null,null,null,"※ 船舶番号が6桁の船舶の場合は後者の枠に記載ください"]
[]
[null,null,"●","航行区域"]
[null,null,null,null,"選択してください"]
[]
[null,null,"●","最大とう載人員（平水区域の場合）",null,null,null,null,null,null,null,null,null,null,null,null,null,null,null,null,null,null,null,null,"●","最大とう載人員（沿海区域の場合）"]
[null,null,null,null,"旅客",null,null,null,null,0,null,null,null,null,null,null,null,null,null,null,null,null,null,null,null,null,"旅客",null,null,null,null,0]
[null,null,null,null,"船員",null,null,null,null,0,null,null,null,null,null,null,null,null,null,null,null,null,null,null,null,null,"船員",null,null,null,null,0]
[null,null,null,null,"その他の乗船者",null,null,null,null,0,null,null,null,null,null,null,null,null,null,null,null,null,null,null,null,null,"その他の乗船者",null,null,null,null,0]
[null,null,null,null,"計",null,null,null,null,{"$f":"SUM(J27:N29)","v":0},null,null,null,null,"※ 旅客＋船員＋その他の乗船員",null,null,null,null,null,null,null,null,null,null,null,"計",null,null,null,null,{"$f":"SUM(AF27:AJ29)","v":0},null,null,null,null,"※ 旅客＋船員＋その他の乗船員"]
[]
[null,null,"●","該当する船舶構造"]
[null,null,null,null,false,"水密全通甲板を有する船舶"]
[null,null,null,null,false,"不沈性及び安定性を有する船舶"]
[]
[null,null,"B 航行する水域の情報（救命いかだ等の搭載を要する期間の特定）"]
[null,null,"●","航行する水域"]
[null,null,null,null,"船舶検査証書に記載された航行区域を覆うように水域番号を入力してください。　※水域番号は以下[マップボタン]を押下してマップを参照してください。"]
[]
[]
[null,null,null,null,"水域番号",null,null,"海域名",null,null,null,null,null,null,null,null,null,"水温",null,null,null,null,null,null,null,null,null,null,null,"北南",null,null,null,null,null,null,null,"東西",null,null,null,null,null,null,null,null,null,null,null,null,null,null,"水温"]
[null,null,null,null,null,null,null,null,null,null,null,null,null,null,null,null,null,"10℃未満",null,null,null,"10℃以上15℃未満",null,null,null,"15℃以上20℃未満",null,null,null,"北端",null,null,null,"南端",null,null,null,"東端",null,null,null,"西端",null,null,null,null,null,null,null,null,null,null,"10℃未満","15℃未満","20℃未満"]
[null,null,null,null,6,null,null,{"$f":"IFERROR(VLOOKUP(E43,海域リスト!B$4:C$130,2,FALSE),\"\")","v":"中海"},null,null,null,null,null,null,null,null,null,{"$f":"IF(OR(BA43=\"なし\",BA43=\"\"),\"-\",IF(OR(BD43<>\"\",BE43<>\"\"),IFERROR(TEXT(BD43,\"m/d\")&\"～\"&TEXT(BE43,\"m/d\"),\"\"),\"\"))","v":"12/13～3/20"},null,null,null,{"$f":"IF(BB43=\"4/1~3/31\",TEXT(BG43,\"m/d\")&\"～\"&TEXT(BF43,\"m/d\"),IF(AND(BB43=\"-\",BC43=\"-\"),\"-\",IF(OR(BB43=\"なし\",BB43=\"\"),\"-\",IFERROR(TEXT(BF43,\"m/d\")&\"～\"&IF(BD43=\"\",\"\",TEXT(BD43-1,\"m/d\")&\"、\"&CHAR(10)&TEXT(BE43+1,\"m/d\")&\"～\")&TEXT(BG43,\"m/d\"),\"\"))))","v":"-"},null,null,null,{"$f":"IF(BC43=\"4/1~3/31\",TEXT(BI43,\"m/d\")&\"～\"&TEXT(BH43,\"m/d\"),IF(AND(BB43=\"-\",BC43=\"-\"),\"-\",IF(OR(BC43=\"なし\",BC43=\"\"),\"-\",IFERROR(TEXT(BH43,\"m/d\")&\"～\"&IF(BF43=\"\",\"\",TEXT(BF43-1,\"m/d\")&\"、\"&CHAR(10)&TEXT(BG43+1,\"m/d\")&\"～\")&TEXT(BI43,\"m/d\"),\"\"))))","v":"-"},null,null,null,{"$f":"IFERROR(VLOOKUP(E43,海域リスト!B$4:H$130,7,FALSE),\"\")","v":"-"},null,null,null,{"$f":"IFERROR(VLOOKUP(E43,海域リスト!B$4:I$130,8,FALSE),\"\")","v":"-"},null,null,null,{"$f":"IFERROR(VLOOKUP(E43,海域リスト!B$4:J$130,9,FALSE),\"\")","v":"-"},null,null,"",{"$f":"IFERROR(VLOOKUP(E43,海域リスト!B$4:K$130,10,FALSE),\"\")","v":"-"},null,null,null,null,null,null,null,null,null,null,{"$f":"IFERROR(VLOOKUP(E43,海域リスト!B$4:E$130,3,FALSE),\"\")","v":"12/13~3/20"},{"$f":"IFERROR(VLOOKUP(E43,海域リスト!B$4:F$130,4,FALSE),\"\")","v":"-"},{"$f":"IFERROR(VLOOKUP(E43,海域リスト!B$4:G$130,5,FALSE),\"\")","v":"-"},{"$f":"IFERROR(IF(DATEVALUE(LEFT(BA43,FIND(\"~\",BA43)-1))<DATEVALUE(\"4/1\"),EDATE(DATEVALUE(LEFT(BA43,FIND(\"~\",BA43)-1)),12),DATEVALUE(LEFT(BA43,FIND(\"~\",BA43)-1))),\"\")","v":"2026-12-13"},{"$f":"IFERROR(IF(DATEVALUE(RIGHT(BA43,LEN(BA43)-FIND(\"~\",BA43)))<DATEVALUE(\"4/1\"),EDATE(DATEVALUE(RIGHT(BA43,LEN(BA43)-FIND(\"~\",BA43))),12),DATEVALUE(RIGHT(BA43,LEN(BA43)-FIND(\"~\",BA43)))),\"\")","v":"2027-03-20"},{"$f":"IFERROR(IF(BB43=\"4/1~3/31\",BD43-1,IF(DATEVALUE(LEFT(BB43,FIND(\"~\",BB43)-1))<DATEVALUE(\"4/1\"),EDATE(DATEVALUE(LEFT(BB43,FIND(\"~\",BB43)-1)),12),DATEVALUE(LEFT(BB43,FIND(\"~\",BB43)-1)))),\"\")","v":""},{"$f":"IFERROR(IF(BB43=\"4/1~3/31\",BE43+1,IF(DATEVALUE(RIGHT(BB43,LEN(BB43)-FIND(\"~\",BB43)))<DATEVALUE(\"4/1\"),EDATE(DATEVALUE(RIGHT(BB43,LEN(BB43)-FIND(\"~\",BB43))),12),DATEVALUE(RIGHT(BB43,LEN(BB43)-FIND(\"~\",BB43))))),\"\")","v":""},{"$f":"IFERROR(IF(BC43=\"4/1~3/31\",BF43-1,IF(DATEVALUE(LEFT(BC43,FIND(\"~\",BC43)-1))<DATEVALUE(\"4/1\"),EDATE(DATEVALUE(LEFT(BC43,FIND(\"~\",BC43)-1)),12),DATEVALUE(LEFT(BC43,FIND(\"~\",BC43)-1)))),\"\")","v":""},{"$f":"IFERROR(IF(BC43=\"4/1~3/31\",BG43+1,IF(DATEVALUE(RIGHT(BC43,LEN(BC43)-FIND(\"~\",BC43)))<DATEVALUE(\"4/1\"),EDATE(DATEVALUE(RIGHT(BC43,LEN(BC43)-FIND(\"~\",BC43))),12),DATEVALUE(RIGHT(BC43,LEN(BC43)-FIND(\"~\",BC43))))),\"\")","v":""},{"$f":"IFERROR(IF(DATEVALUE(LEFT(BA43,FIND(\"~\",BA43)-1))<DATEVALUE(\"4/1\"),EDATE(DATEVALUE(LEFT(BA43,FIND(\"~\",BA43)-1)),12),DATEVALUE(LEFT(BA43,FIND(\"~\",BA43)-1))),\"\")","v":"2026-12-13"},{"$f":"IFERROR(IF(DATEVALUE(RIGHT(BA43,LEN(BA43)-FIND(\"~\",BA43)))<DATEVALUE(\"4/1\"),EDATE(DATEVALUE(RIGHT(BA43,LEN(BA43)-FIND(\"~\",BA43))),12),DATEVALUE(RIGHT(BA43,LEN(BA43)-FIND(\"~\",BA43)))),\"\")","v":"2027-03-20"},{"$f":"IFERROR(IF(DATEVALUE(LEFT(BB43,FIND(\"~\",BB43)-1))<DATEVALUE(\"4/1\"),EDATE(DATEVALUE(LEFT(BB43,FIND(\"~\",BB43)-1)),12),DATEVALUE(LEFT(BB43,FIND(\"~\",BB43)-1))),\"\")","v":""},{"$f":"IFERROR(IF(DATEVALUE(RIGHT(BB43,LEN(BB43)-FIND(\"~\",BB43)))<DATEVALUE(\"4/1\"),EDATE(DATEVALUE(RIGHT(BB43,LEN(BB43)-FIND(\"~\",BB43))),12),DATEVALUE(RIGHT(BB43,LEN(BB43)-FIND(\"~\",BB43)))),\"\")","v":""},{"$f":"IFERROR(IF(DATEVALUE(LEFT(BC43,FIND(\"~\",BC43)-1))<DATEVALUE(\"4/1\"),EDATE(DATEVALUE(LEFT(BC43,FIND(\"~\",BC43)-1)),12),DATEVALUE(LEFT(BC43,FIND(\"~\",BC43)-1))),\"\")","v":""},{"$f":"IFERROR(IF(DATEVALUE(RIGHT(BC43,LEN(BC43)-FIND(\"~\",BC43)))<DATEVALUE(\"4/1\"),EDATE(DATEVALUE(RIGHT(BC43,LEN(BC43)-FIND(\"~\",BC43))),12),DATEVALUE(RIGHT(BC43,LEN(BC43)-FIND(\"~\",BC43)))),\"\")","v":""}]
[null,null,null,null,null,null,null,{"$f":"IFERROR(VLOOKUP(E44,海域リスト!B$4:C$130,2,FALSE),\"\")","v":""},null,null,null,null,null,null,null,null,null,{"$f":"IF(OR(BA44=\"なし\",BA44=\"\"),\"-\",IF(OR(BD44<>\"\",BE44<>\"\"),IFERROR(TEXT(BD44,\"m/d\")&\"～\"&TEXT(BE44,\"m/d\"),\"\"),\"\"))","v":"-"},null,null,null,{"$f":"IF(BB44=\"4/1~3/31\",TEXT(BG44,\"m/d\")&\"～\"&TEXT(BF44,\"m/d\"),IF(AND(BB44=\"-\",BC44=\"-\"),\"-\",IF(OR(BB44=\"なし\",BB44=\"\"),\"-\",IFERROR(TEXT(BF44,\"m/d\")&\"～\"&IF(BD44=\"\",\"\",TEXT(BD44-1,\"m/d\")&\"、\"&CHAR(10)&TEXT(BE44+1,\"m/d\")&\"～\")&TEXT(BG44,\"m/d\"),\"\"))))","v":"-"},null,null,null,{"$f":"IF(BC44=\"4/1~3/31\",TEXT(BI44,\"m/d\")&\"～\"&TEXT(BH44,\"m/d\"),IF(AND(BB44=\"-\",BC44=\"-\"),\"-\",IF(OR(BC44=\"なし\",BC44=\"\"),\"-\",IFERROR(TEXT(BH44,\"m/d\")&\"～\"&IF(BF44=\"\",\"\",TEXT(BF44-1,\"m/d\")&\"、\"&CHAR(10)&TEXT(BG44+1,\"m/d\")&\"～\")&TEXT(BI44,\"m/d\"),\"\"))))","v":"-"},null,null,null,{"$f":"IFERROR(VLOOKUP(E44,海域リスト!B$4:H$130,7,FALSE),\"\")","v":""},null,null,null,{"$f":"IFERROR(VLOOKUP(E44,海域リスト!B$4:I$130,8,FALSE),\"\")","v":""},null,null,null,{"$f":"IFERROR(VLOOKUP(E44,海域リスト!B$4:J$130,9,FALSE),\"\")","v":""},null,null,"",{"$f":"IFERROR(VLOOKUP(E44,海域リスト!B$4:K$130,10,FALSE),\"\")","v":""},null,null,null,null,null,null,null,null,null,null,{"$f":"IFERROR(VLOOKUP(E44,海域リスト!B$4:E$130,3,FALSE),\"\")","v":""},{"$f":"IFERROR(VLOOKUP(E44,海域リスト!B$4:F$130,4,FALSE),\"\")","v":""},{"$f":"IFERROR(VLOOKUP(E44,海域リスト!B$4:G$130,5,FALSE),\"\")","v":""},{"$f":"IFERROR(IF(DATEVALUE(LEFT(BA44,FIND(\"~\",BA44)-1))<DATEVALUE(\"4/1\"),EDATE(DATEVALUE(LEFT(BA44,FIND(\"~\",BA44)-1)),12),DATEVALUE(LEFT(BA44,FIND(\"~\",BA44)-1))),\"\")","v":""},{"$f":"IFERROR(IF(DATEVALUE(RIGHT(BA44,LEN(BA44)-FIND(\"~\",BA44)))<DATEVALUE(\"4/1\"),EDATE(DATEVALUE(RIGHT(BA44,LEN(BA44)-FIND(\"~\",BA44))),12),DATEVALUE(RIGHT(BA44,LEN(BA44)-FIND(\"~\",BA44)))),\"\")","v":""},{"$f":"IFERROR(IF(BB44=\"4/1~3/31\",BD44-1,IF(DATEVALUE(LEFT(BB44,FIND(\"~\",BB44)-1))<DATEVALUE(\"4/1\"),EDATE(DATEVALUE(LEFT(BB44,FIND(\"~\",BB44)-1)),12),DATEVALUE(LEFT(BB44,FIND(\"~\",BB44)-1)))),\"\")","v":""},{"$f":"IFERROR(IF(BB44=\"4/1~3/31\",BE44+1,IF(DATEVALUE(RIGHT(BB44,LEN(BB44)-FIND(\"~\",BB44)))<DATEVALUE(\"4/1\"),EDATE(DATEVALUE(RIGHT(BB44,LEN(BB44)-FIND(\"~\",BB44))),12),DATEVALUE(RIGHT(BB44,LEN(BB44)-FIND(\"~\",BB44))))),\"\")","v":""},{"$f":"IFERROR(IF(BC44=\"4/1~3/31\",BF44-1,IF(DATEVALUE(LEFT(BC44,FIND(\"~\",BC44)-1))<DATEVALUE(\"4/1\"),EDATE(DATEVALUE(LEFT(BC44,FIND(\"~\",BC44)-1)),12),DATEVALUE(LEFT(BC44,FIND(\"~\",BC44)-1)))),\"\")","v":""},{"$f":"IFERROR(IF(BC44=\"4/1~3/31\",BG44+1,IF(DATEVALUE(RIGHT(BC44,LEN(BC44)-FIND(\"~\",BC44)))<DATEVALUE(\"4/1\"),EDATE(DATEVALUE(RIGHT(BC44,LEN(BC44)-FIND(\"~\",BC44))),12),DATEVALUE(RIGHT(BC44,LEN(BC44)-FIND(\"~\",BC44))))),\"\")","v":""},{"$f":"IFERROR(IF(DATEVALUE(LEFT(BA44,FIND(\"~\",BA44)-1))<DATEVALUE(\"4/1\"),EDATE(DATEVALUE(LEFT(BA44,FIND(\"~\",BA44)-1)),12),DATEVALUE(LEFT(BA44,FIND(\"~\",BA44)-1))),\"\")","v":""},{"$f":"IFERROR(IF(DATEVALUE(RIGHT(BA44,LEN(BA44)-FIND(\"~\",BA44)))<DATEVALUE(\"4/1\"),EDATE(DATEVALUE(RIGHT(BA44,LEN(BA44)-FIND(\"~\",BA44))),12),DATEVALUE(RIGHT(BA44,LEN(BA44)-FIND(\"~\",BA44)))),\"\")","v":""},{"$f":"IFERROR(IF(DATEVALUE(LEFT(BB44,FIND(\"~\",BB44)-1))<DATEVALUE(\"4/1\"),EDATE(DATEVALUE(LEFT(BB44,FIND(\"~\",BB44)-1)),12),DATEVALUE(LEFT(BB44,FIND(\"~\",BB44)-1))),\"\")","v":""},{"$f":"IFERROR(IF(DATEVALUE(RIGHT(BB44,LEN(BB44)-FIND(\"~\",BB44)))<DATEVALUE(\"4/1\"),EDATE(DATEVALUE(RIGHT(BB44,LEN(BB44)-FIND(\"~\",BB44))),12),DATEVALUE(RIGHT(BB44,LEN(BB44)-FIND(\"~\",BB44)))),\"\")","v":""},{"$f":"IFERROR(IF(DATEVALUE(LEFT(BC44,FIND(\"~\",BC44)-1))<DATEVALUE(\"4/1\"),EDATE(DATEVALUE(LEFT(BC44,FIND(\"~\",BC44)-1)),12),DATEVALUE(LEFT(BC44,FIND(\"~\",BC44)-1))),\"\")","v":""},{"$f":"IFERROR(IF(DATEVALUE(RIGHT(BC44,LEN(BC44)-FIND(\"~\",BC44)))<DATEVALUE(\"4/1\"),EDATE(DATEVALUE(RIGHT(BC44,LEN(BC44)-FIND(\"~\",BC44))),12),DATEVALUE(RIGHT(BC44,LEN(BC44)-FIND(\"~\",BC44)))),\"\")","v":""}]
[null,null,null,null,null,null,null,{"$f":"IFERROR(VLOOKUP(E45,海域リスト!B$4:C$130,2,FALSE),\"\")","v":""},null,null,null,null,null,null,null,null,null,"-",null,null,null,"-",null,null,null,"-",null,null,null,{"$f":"IFERROR(VLOOKUP(E45,海域リスト!B$4:H$130,7,FALSE),\"\")","v":""},null,null,null,{"$f":"IFERROR(VLOOKUP(E45,海域リスト!B$4:I$130,8,FALSE),\"\")","v":""},null,null,null,{"$f":"IFERROR(VLOOKUP(E45,海域リスト!B$4:J$130,9,FALSE),\"\")","v":""},null,null,"",{"$f":"IFERROR(VLOOKUP(E45,海域リスト!B$4:K$130,10,FALSE),\"\")","v":""},null,null,null,null,null,null,null,null,null,null,{"$f":"IFERROR(VLOOKUP(E45,海域リスト!B$4:E$130,3,FALSE),\"\")","v":""},{"$f":"IFERROR(VLOOKUP(E45,海域リスト!B$4:F$130,4,FALSE),\"\")","v":""},{"$f":"IFERROR(VLOOKUP(E45,海域リスト!B$4:G$130,5,FALSE),\"\")","v":""},{"$f":"IFERROR(IF(DATEVALUE(LEFT(BA45,FIND(\"~\",BA45)-1))<DATEVALUE(\"4/1\"),EDATE(DATEVALUE(LEFT(BA45,FIND(\"~\",BA45)-1)),12),DATEVALUE(LEFT(BA45,FIND(\"~\",BA45)-1))),\"\")","v":""},{"$f":"IFERROR(IF(DATEVALUE(RIGHT(BA45,LEN(BA45)-FIND(\"~\",BA45)))<DATEVALUE(\"4/1\"),EDATE(DATEVALUE(RIGHT(BA45,LEN(BA45)-FIND(\"~\",BA45))),12),DATEVALUE(RIGHT(BA45,LEN(BA45)-FIND(\"~\",BA45)))),\"\")","v":""},"","","","","","","","","",""]
[null,null,null,null,null,null,null,{"$f":"IFERROR(VLOOKUP(E46,海域リスト!B$4:C$130,2,FALSE),\"\")","v":""},null,null,null,null,null,null,null,null,null,"-",null,null,null,"-",null,null,null,"-",null,null,null,{"$f":"IFERROR(VLOOKUP(E46,海域リスト!B$4:H$130,7,FALSE),\"\")","v":""},null,null,null,{"$f":"IFERROR(VLOOKUP(E46,海域リスト!B$4:I$130,8,FALSE),\"\")","v":""},null,null,null,{"$f":"IFERROR(VLOOKUP(E46,海域リスト!B$4:J$130,9,FALSE),\"\")","v":""},null,null,"",{"$f":"IFERROR(VLOOKUP(E46,海域リスト!B$4:K$130,10,FALSE),\"\")","v":""},null,null,null,null,null,null,null,null,null,null,{"$f":"IFERROR(VLOOKUP(E46,海域リスト!B$4:E$130,3,FALSE),\"\")","v":""},{"$f":"IFERROR(VLOOKUP(E46,海域リスト!B$4:F$130,4,FALSE),\"\")","v":""},{"$f":"IFERROR(VLOOKUP(E46,海域リスト!B$4:G$130,5,FALSE),\"\")","v":""},{"$f":"IFERROR(IF(DATEVALUE(LEFT(BA46,FIND(\"~\",BA46)-1))<DATEVALUE(\"4/1\"),EDATE(DATEVALUE(LEFT(BA46,FIND(\"~\",BA46)-1)),12),DATEVALUE(LEFT(BA46,FIND(\"~\",BA46)-1))),\"\")","v":""},{"$f":"IFERROR(IF(DATEVALUE(RIGHT(BA46,LEN(BA46)-FIND(\"~\",BA46)))<DATEVALUE(\"4/1\"),EDATE(DATEVALUE(RIGHT(BA46,LEN(BA46)-FIND(\"~\",BA46))),12),DATEVALUE(RIGHT(BA46,LEN(BA46)-FIND(\"~\",BA46)))),\"\")","v":""},"","","","","","","","","",""]
[null,null,null,null,null,null,null,{"$f":"IFERROR(VLOOKUP(E47,海域リスト!B$4:C$130,2,FALSE),\"\")","v":""},null,null,null,null,null,null,null,null,null,"-",null,null,null,"-",null,null,null,"-",null,null,null,{"$f":"IFERROR(VLOOKUP(E47,海域リスト!B$4:H$130,7,FALSE),\"\")","v":""},null,null,null,{"$f":"IFERROR(VLOOKUP(E47,海域リスト!B$4:I$130,8,FALSE),\"\")","v":""},null,null,null,{"$f":"IFERROR(VLOOKUP(E47,海域リスト!B$4:J$130,9,FALSE),\"\")","v":""},null,null,"",{"$f":"IFERROR(VLOOKUP(E47,海域リスト!B$4:K$130,10,FALSE),\"\")","v":""},null,null,null,null,null,null,null,null,null,null,{"$f":"IFERROR(VLOOKUP(E47,海域リスト!B$4:E$130,3,FALSE),\"\")","v":""},{"$f":"IFERROR(VLOOKUP(E47,海域リスト!B$4:F$130,4,FALSE),\"\")","v":""},{"$f":"IFERROR(VLOOKUP(E47,海域リスト!B$4:G$130,5,FALSE),\"\")","v":""},{"$f":"IFERROR(IF(DATEVALUE(LEFT(BA47,FIND(\"~\",BA47)-1))<DATEVALUE(\"4/1\"),EDATE(DATEVALUE(LEFT(BA47,FIND(\"~\",BA47)-1)),12),DATEVALUE(LEFT(BA47,FIND(\"~\",BA47)-1))),\"\")","v":""},{"$f":"IFERROR(IF(DATEVALUE(RIGHT(BA47,LEN(BA47)-FIND(\"~\",BA47)))<DATEVALUE(\"4/1\"),EDATE(DATEVALUE(RIGHT(BA47,LEN(BA47)-FIND(\"~\",BA47))),12),DATEVALUE(RIGHT(BA47,LEN(BA47)-FIND(\"~\",BA47)))),\"\")","v":""},"","","","","","","","","",""]
[null,null,null,null,"該当期間の航行有無",null,null,null,null,null,null,null,null,null,null,null,null,"水温①",null,null,null,"水温②",null,null,null,"水温③"]
[null,null,null,null,null,null,null,null,null,null,null,null,null,null,null,null,null,{"$f":"IF(OR(BD49=\"なし\",BD49=\"\"),\"該当期間なし\",IFERROR(TEXT(BD49,\"m/d\")&\"～\"&TEXT(BE49,\"m/d\"),\"\"))","v":"12/13～3/20"},null,null,null,{"$f":"IF(OR(BF49=\"なし\",BF49=\"\",E24=\"平水区域\"),\"該当期間なし\",IFERROR(IF(AND(BF49 = IF(ISNUMBER(BD49), BD49-1, 0),IF(ISNUMBER(BE49), BE49+1, 0) = BG49),TEXT(BE49+1,\"m/d\") & \"～\" & TEXT(BF49,\"m/d\"),TEXT(BE49+1,\"m/d\") & \"～\" & TEXT(BG49,\"m/d\")),\"\"))","v":"該当期間なし"},null,null,null,{"$f":"IF(OR(BH49=\"なし\",BH49=\"\",E24=\"平水区域\"),\"該当期間なし\",IFERROR(IF(AND(BH49=IF(ISNUMBER(BF49),BF49-1,0),IF(ISNUMBER(BG49),BG49+1,0)=BI49),TEXT(BG49+1,\"m/d\")&\"～\"&TEXT(BH49,\"m/d\"),TEXT(BH49,\"m/d\")&\"～\"&IF(BD49=\"なし\",\"\",TEXT(BD49-1,\"m/d\")&\"、\"&CHAR(10)&TEXT(BG49+1,\"m/d\")&\"～\")&TEXT(BI49,\"m/d\")),\"\"))","v":"該当期間なし"},null,null,null,null,null,null,null,null,null,null,null,null,null,null,null,null,null,null,null,null,null,null,null,null,null,null,{"$f":"TEXT(BD49,\"m/d\") & \"～\" & TEXT(BE49,\"m/d\")","v":"12/13～3/20"},{"$f":"TEXT(BF49,\"m/d\") & \"～\" & TEXT(BG49,\"m/d\")","v":"なし～なし"},{"$f":"TEXT(BH49,\"m/d\") & \"～\" & TEXT(BI49,\"m/d\")","v":"なし～なし"},{"$f":"IF(MIN(BD43:BD47)=0,\"なし\",MIN(BD43:BD47))","v":"2026-12-13"},{"$f":"IF(MAX(BE43:BE47)=0,\"なし\",MAX(BE43:BE47))","v":"2027-03-20"},{"$f":"IF(MIN(BF43:BF47)=0,\"なし\",MIN(BF43:BF47))","v":"なし"},{"$f":"IF(MAX(BG43:BG47)=0,\"なし\",MAX(BG43:BG47))","v":"なし"},{"$f":"IF(MIN(BH43:BH47)=0,\"なし\",MIN(BH43:BH47))","v":"なし"},{"$f":"IF(MAX(BI43:BI47)=0,\"なし\",MAX(BI43:BI47))","v":"なし"},{"$f":"IF(MIN(BJ43:BJ47)=0,\"なし\",MIN(BJ43:BJ47))","v":"2026-12-13"},{"$f":"IF(MAX(BK43:BK47)=0,\"なし\",MAX(BK43:BK47))","v":"2027-03-20"},{"$f":"IF(MIN(BL43:BL47)=0,\"なし\",MIN(BL43:BL47))","v":"なし"},{"$f":"IF(MAX(BM43:BM47)=0,\"なし\",MAX(BM43:BM47))","v":"なし"},{"$f":"IF(MIN(BN43:BN47)=0,\"なし\",MIN(BN43:BN47))","v":"なし"},{"$f":"IF(MAX(BO43:BO47)=0,\"なし\",MAX(BO43:BO47))","v":"なし"}]
[null,null,null,null,null,null,null,null,null,null,null,null,null,null,null,null,null,"航行しない",null,null,null,"航行しない",null,null,null,"航行しない",null,null,null,null,"※左記の「航行する/航行しない」欄は、旅客を搭載しての航行の有無を選択してください。",null,null,null,null,null,null,null,null,null,null,null,null,null,null,null,null,null,null,null,null,null,{"$f":"TEXT(BJ49,\"m/d\") & \"～\" & TEXT(BK49,\"m/d\")","v":"12/13～3/20"},{"$f":"TEXT(BL49,\"m/d\") & \"～\" & TEXT(BM49,\"m/d\")","v":"なし～なし"},{"$f":"TEXT(BN49,\"m/d\") & \"～\" & TEXT(BO49,\"m/d\")","v":"なし～なし"}]
[]
[]
[null,null,"C 適用する「救命いかだ等の搭載を要しない方法」の選択"]
[null,null,"●","適用する「救命いかだ等の搭載を要しない方法」",null,null,null,null,null,null,null,null,null,null,null,null,null,null,null,null,null,null,null,null,null,null,null,null,null,null,null,null,null,null,null,null,null,null,null,null,null,null,null,null,null,null,null,null,null,null,null,null,null,null,null,"該当期間の航行有無",null,null,null,{"$f":"IFERROR(DATEVALUE(RIGHT(AU54,LEN(AU54)-FIND(\"~\",AU54))),\"\")","v":""},{"$f":"IFERROR(DATEVALUE(RIGHT(AV54,LEN(AV54)-FIND(\"~\",AV54))),\"\")","v":""}]
[null,null,null,null,"それぞれの時期ごとに適用する「救命いかだ等の搭載を要しない方法」を選択してください。",null,null,null,null,null,null,null,null,null,null,null,null,null,null,null,null,null,null,null,null,null,null,null,null,null,null,null,null,null,null,null,null,null,null,null,null,null,null,null,null,null,null,null,null,null,null,null,null,null,null,"航行する"]
[null,null,null,null,"（複数の方法を組み合わせる場合は、組み合わせる方法全てを選択してください。）",null,null,null,null,null,null,null,null,null,null,null,null,null,null,null,null,null,null,null,null,null,null,null,null,null,null,null,null,null,null,null,null,null,null,null,null,null,null,null,null,null,null,null,null,null,null,null,null,null,null,"航行しない"]
[null,null,null,null,null,null,null,null,null,null,null,null,null,null,null,null,null,null,"水温①",null,null,null,null,null,null,null,null,"水温②",null,null,null,null,null,null,null,null,"水温③"]
[null,null,null,null,null,null,null,null,null,null,null,null,null,null,null,null,null,null,{"$f":"R49","v":"12/13～3/20"},null,null,null,null,null,null,null,null,{"$f":"V49","v":"該当期間なし"},null,null,null,null,null,null,null,null,{"$f":"Z49","v":"該当期間なし"}]
[null,null,null,null,"特例①　一定の水温を下回る時期に航行しない",null,null,null,null,null,null,null,null,null,null,null,null,null,null,null,null,null,true,null,null,null,null,null,null,null,null,true,null,null,null,null,null,null,null,null,true]
[null,null,null,null,"特例②　伴走船と共に航行する",null,null,null,null,null,null,null,null,null,null,null,null,null,null,null,null,null,false,null,null,null,null,null,null,null,null,false,null,null,null,null,null,null,null,null,false]
[null,null,null,null,"特例③　救助船を配備する",null,null,null,null,null,null,null,null,null,null,null,null,null,null,null,null,null,false,null,null,null,null,null,null,null,null,false,null,null,null,null,null,null,null,null,false]
[null,null,null,null,"特例④　船内に浸水しない構造を有する",null,null,null,null,null,null,null,null,null,null,null,null,null,null,null,null,null,false,null,null,null,null,null,null,null,null,false,null,null,null,null,null,null,null,null,false]
[null,null,null,null,"特例⑤　母港から５海里を超えて航行しない",null,null,null,null,null,null,null,null,null,null,null,null,null,null,null,null,null,false,null,null,null,null,null,null,null,null,false,null,null,null,null,null,null,null,null,false]

{"sheet":"水温①","index":2,"n_rows":78,"n_cols":44,"rows_kept":78,"cut":false,"hidden":true,"merged":[[27,4,27,12],[27,13,27,21],[27,22,27,30],[27,31,27,39],[27,40,27,48],[17,4,17,48],[26,13,26,21],[26,22,26,30],[26,31,26,39],[26,40,26,48],[21,4,21,48],[28,34,28,36],[28,40,28,41],[28,43,28,45],[29,4,29,12],[29,13,29,21],[29,22,29,30],[29,31,29,39],[29,40,29,48],[28,4,28,12],[28,13,28,14],[28,16,28,18],[28,22,28,23],[28,25,28,27],[28,31,28,32],[44,4,44,48],[30,4,30,12],[30,13,30,21],[30,22,30,30],[30,31,30,39],[30,40,30,48],[74,4,74,28],[71,4,71,9],[71,12,71,20],[54,4,54,12],[54,13,54,21],[53,4,53,12],[53,13,53,21],[49,13,49,21],[50,4,50,12],[50,13,50,21],[51,4,51,12],[51,13,51,14],[51,16,51,18],[52,4,52,12],[52,13,52,21]]}
[]
[]
[null,null,"■水温①（航行する水域に水温10℃未満となる水域が含まれる時期）の詳細情報"]
[]
[null,null,"●","特例① 一定の水温を下回る時期に航行しない船舶"]
[]
[null,null,null,"●",{"$f":"\"営業船が、\"&基礎情報!S58&\"の期間において航行時に講じる安全対策（特例②、③、④、⑤のいずれかの特例を講じて航行する場合は除く）\"","v":"営業船が、12/13～3/20の期間において航行時に講じる安全対策（特例②、③、④、⑤のいずれかの特例を講じて航行する場合は除く）"}]
[null,null,null,null,false,"救命いかだ等の搭載が必要となる水域を航行しない。"]
[null,null,null,null,false,"水温10℃以上となる平水区域以外を航行しない。"]
[]
[]
[]
[null,null,"●","特例② 伴走船と共に航行する船舶"]
[]
[null,null,null,"●",{"$f":"\"営業船が、\"&基礎情報!S58&\"の期間において伴走船を伴い航行する際の遵守事項\"","v":"営業船が、12/13～3/20の期間において伴走船を伴い航行する際の遵守事項"}]
[null,null,null,null,"【遵守事項】"]
[null,null,null,null,{"$f":"\"営業船（\"&基礎情報!E18&\"、船舶番号\"&基礎情報!E21&\"-\"&基礎情報!H21&\"）は、海域\"&oTEXTJOIN(\",\",TRUE,基礎情報!E43,基礎情報!E44,基礎情報!E45,基礎情報!E46,基礎情報!E47)&\"（\"&基礎情報!E24&\"）を航行する際、別表（伴走船）に掲げる船舶（以下「伴走船」という。）と共に航行する。\"","v":"営業船（船名を入力してください、船舶番号XXX-XXXXX）は、海域6（選択してください）を航行する際、別表（伴走船）に掲げる船舶（以下「伴走船」という。）と共に航行する。"}]
[null,null,null,null,"\n営業船の船舶所有者の責任において、伴走船には下記の事項を遵守させる。"]
[null,null,null,null,"・３隻以内の伴走船と共に航行すること"]
[null,null,null,null,"・伴走船の搭載人員は、別表の搭載可能人員を超えることなく、営業船の搭載人員分を搭載（救助）できるようにすること"]
[null,null,null,null,"・伴走船が、出航から帰港まで営業船を常に視認でき、かつ、万が一乗客が水中待機した場合であっても早急に救助できる位置を航行すること"]
[null,null,null,null,"・伴走船には、船長のほか救助を補佐する者１名以上が乗船すること\n　（なお、船員以外の者を補佐人として指定する場合、船長はその者に対し、発航前にその旨を説明し理解を得ること）"]
[]
[null,null,null,null,false,"上記の全ての遵守事項に同意します。"]
[]
[null,null,null,"●","別表（伴走船）"]
[null,null,null,null,null,null,null,null,null,null,null,null,null,"営業船",null,null,null,null,null,null,null,null,"伴走船A",null,null,null,null,null,null,null,null,"伴走船B",null,null,null,null,null,null,null,null,"伴走船C"]
[null,null,null,null,"船名",null,null,null,null,null,null,null,null,{"$f":"基礎情報!E18","v":"船名を入力してください"},null,null,null,null,null,null,null,null,"船名を入力してください",null,null,null,null,null,null,null,null,"船名を入力してください",null,null,null,null,null,null,null,null,"船名を入力してください"]
[null,null,null,null,"船舶番号",null,null,null,null,null,null,null,null,{"$f":"基礎情報!E21","v":"XXX"},null,"-",{"$f":"基礎情報!H21","v":"XXXXX"},null,null,null,null,null,"XXX",null,"-","XXXXX",null,null,null,null,null,"XXX",null,"-","XXXXX",null,null,null,null,null,"XXX",null,"-","XXXXX"]
[null,null,null,null,"認定番号",null,null,null,null,null,null,null,null,"ー",null,null,null,null,null,null,null,null,"認定番号を入力してください",null,null,null,null,null,null,null,null,"認定番号を入力してください",null,null,null,null,null,null,null,null,"認定番号を入力してください"]
[null,null,null,null,"搭載可能人員\n（最大搭載人員＋要救助者用別枠定員）",null,null,null,null,null,null,null,null,{"$f":"oIFS(基礎情報!E24=\"平水区域\",基礎情報!J30,基礎情報!E24=\"沿海区域\",基礎情報!AF30,基礎情報!E24=\"選択してください\",0)","v":0},null,null,null,null,null,null,null,null,0,null,null,null,null,null,null,null,null,0,null,null,null,null,null,null,null,null,0]
[null,null,null,null,"※４隻以上の船舶を伴走船として申告する場合、操作手順書の11ページを確認してください。"]
[]
[]
[]
[null,null,"●","特例③ 救助船を配備する船舶"]
[]
[null,null,null,"●",{"$f":"\"営業船が、\"&基礎情報!S58&\"の期間において航行時に配備する救助船の遵守事項\"","v":"営業船が、12/13～3/20の期間において航行時に配備する救助船の遵守事項"}]
[null,null,null,null,"＜遵守事項＞"]
[null,null,null,null,{"$f":"\"営業船（\"&基礎情報!E18&\"、船舶番号\"&基礎情報!E21&\"-\"&基礎情報!H21&\"）は、海域\"&oTEXTJOIN(\",\",TRUE,基礎情報!E43,基礎情報!E44,基礎情報!E45,基礎情報!E46,基礎情報!E47)&\"（\"&基礎情報!E24&\"）を航行する際、別表（救助船）に掲げる船舶（以下「救助船」という。）を配備する。\"","v":"営業船（船名を入力してください、船舶番号XXX-XXXXX）は、海域6（選択してください）を航行する際、別表（救助船）に掲げる船舶（以下「救助船」という。）を配備する。"}]
[null,null,null,null,"この場合、営業船及び救助船の船員、旅客及びその他乗船者を含め搭載可能となる人数は別表に従った人数とし、営業船の船舶所有者の責任において、救助船には下記の事項を遵守させる。"]
[null,null,null,null," ・営業船の航路が、救助船の航行区域内であること"]
[null,null,null,null," ・救助船は、営業船が航行する間、営業船から救助の要請があった場合に直ちに救助に向かう位置で待機していること"]
[null,null,null,null," ・救助船には、救助時に旅客の搭載しないこと"]
[null,null,null,null," ・救助船には、船長のほか救助を補佐する者１名以上が乗船すること"]
[]
[null,null,null,null,false,"上記の全ての遵守事項に同意します。"]
[]
[null,null,null,"●","別表（救助船）"]
[null,null,null,null,null,null,null,null,null,null,null,null,null,"救助船"]
[null,null,null,null,"船名",null,null,null,null,null,null,null,null,"船名を入力してください"]
[null,null,null,null,"船舶番号",null,null,null,null,null,null,null,null,"XXX",null,"-","XXXXX"]
[null,null,null,null,"救助船の係留場所",null,null,null,null,null,null,null,null,"係留場所を入力してください"]
[null,null,null,null,"認定番号",null,null,null,null,null,null,null,null,"認定番号を入力してください"]
[null,null,null,null,"搭載可能人員\n（最大搭載人員＋要救助者用別枠定員）",null,null,null,null,null,null,null,null,0]
[null,null,null,null,"※２隻以上の船舶を救助船として申告する場合、操作手順書の11ページを確認してください。"]
[]
[]
[]
[null,null,"●","特例④ 船内に浸水しないように措置された船舶",null,null,null,null,null,null,null,null,null,null,null,null,null,null,null,"※水温15℃以上20℃未満の水域を航行する場合に限定して適用可能"]
[]
[null,null,null,"●","船舶構造"]
[null,null,null,null,{"$f":"OR(基礎情報!E33,基礎情報!E34)","v":false},"営業船は水密全通甲板（又は不沈性及び安定性）を有する船舶である。"]
[null,null,null,null,"※特例④のみを選択した場合、水温10℃未満や水温15℃未満の水域を航行する場合の申告が不足しています。"]
[null,null,null,null,"この場合、水温10℃未満や水温15℃未満の水域を航行する場合は特例①（救命いかだ等の搭載が必要な水域を航行しないこと）が申告書に自動で出力されます。"]
[]
[]
[null,null,"●","特例⑤ 母港から5海里を超えて航行しない船舶",null,null,null,null,null,null,null,null,null,null,null,null,null,null,null,"※水温15℃以上20℃未満の水域を航行する場合に限定して適用可能"]
[]
[null,null,null,"●","母港のある都道府県名"]
[null,null,null,null,"都道府県",null,null,null,null,null,null,null,"市区町村 ※リストにない場合、省略可"]
[null,null,null,null,"選択してください",null,null,null,null,null,null,null,"選択してください"]
[]
[null,null,null,null,"営業船の母港"]
[null,null,null,null,"営業船の母港を入力してください"]
[null,null,null,null,"※２か所以上の母港を設定する場合、操作手順書の14ページを確認してください。"]
[null,null,null,null,"※特例⑤のみを選択した場合、水温10℃未満や水温15℃未満の水域を航行する場合の申告が不足しています。"]
[null,null,null,null,"この場合、水温10℃未満や水温15℃未満の水域を航行する場合は特例①（救命いかだ等の搭載が必要な水域を航行しないこと）が申告書に自動で出力されます。"]

{"sheet":"水温②","index":3,"n_rows":78,"n_cols":44,"rows_kept":78,"cut":false,"hidden":true,"merged":[[17,4,17,48],[53,4,53,12],[53,13,53,21],[49,13,49,21],[50,4,50,12],[50,13,50,21],[51,4,51,12],[51,13,51,14],[51,16,51,18],[52,4,52,12],[52,13,52,21],[30,4,30,12],[30,13,30,21],[30,22,30,30],[30,31,30,39],[30,40,30,48],[74,4,74,28],[71,4,71,9],[71,12,71,20],[54,4,54,12],[54,13,54,21],[28,31,28,32],[28,34,28,36],[28,40,28,41],[28,43,28,45],[29,4,29,12],[29,13,29,21],[29,22,29,30],[29,31,29,39],[29,40,29,48],[21,4,21,48],[44,4,44,48],[26,13,26,21],[26,22,26,30],[26,31,26,39],[26,40,26,48],[27,4,27,12],[27,13,27,21],[27,22,27,30],[27,31,27,39],[27,40,27,48],[28,4,28,12],[28,13,28,14],[28,16,28,18],[28,22,28,23],[28,25,28,27]]}
[]
[]
[null,null,"■水温②（航行する水域に水温10℃以上15℃未満となる水域が含まれる時期（水温①の時期を除く。））の詳細情報"]
[]
[null,null,"●","特例① 一定の水温を下回る時期に航行しない船舶"]
[]
[null,null,null,"●",{"$f":"\"営業船が、\"&基礎情報!AB58&\"の期間において航行時に講じる安全対策（特例②、③、④、⑤のいずれかの特例を講じて航行する場合は除く）\"","v":"営業船が、該当期間なしの期間において航行時に講じる安全対策（特例②、③、④、⑤のいずれかの特例を講じて航行する場合は除く）"}]
[null,null,null,null,false,"救命いかだ等の搭載が必要となる水域を航行しない。"]
[null,null,null,null,false,"平水区域以外を航行しない。"]
[]
[]
[]
[null,null,"●","特例② 伴走船と共に航行する船舶"]
[]
[null,null,null,"●",{"$f":"\"営業船が、\"&基礎情報!AB58&\"の期間において伴走船を伴い航行する際の遵守事項\"","v":"営業船が、該当期間なしの期間において伴走船を伴い航行する際の遵守事項"}]
[null,null,null,null,"【遵守事項】"]
[null,null,null,null,{"$f":"\"営業船（\"&基礎情報!E18&\"、船舶番号\"&基礎情報!E21&\"-\"&基礎情報!H21&\"）は、海域\"&oTEXTJOIN(\",\",TRUE,基礎情報!E43,基礎情報!E44,基礎情報!E45,基礎情報!E46,基礎情報!E47)&\"（\"&基礎情報!E24&\"）を航行する際、別表（伴走船）に掲げる船舶（以下「伴走船」という。）と共に航行する。\"","v":"営業船（船名を入力してください、船舶番号XXX-XXXXX）は、海域6（選択してください）を航行する際、別表（伴走船）に掲げる船舶（以下「伴走船」という。）と共に航行する。"}]
[null,null,null,null,"\n営業船の船舶所有者の責任において、伴走船には下記の事項を遵守させる。"]
[null,null,null,null,"・３隻以内の伴走船と共に航行すること"]
[null,null,null,null,"・伴走船の搭載人員は、別表の搭載可能人員を超えることなく、営業船の搭載人員分を搭載（救助）できるようにすること"]
[null,null,null,null,"・伴走船が、出航から帰港まで営業船を常に視認でき、かつ、万が一乗客が水中待機した場合であっても早急に救助できる位置を航行すること"]
[null,null,null,null,"・伴走船には、船長のほか救助を補佐する者１名以上が乗船すること\n　（なお、船員以外の者を補佐人として指定する場合、船長はその者に対し、発航前にその旨を説明し理解を得ること）"]
[]
[null,null,null,null,false,"上記の全ての遵守事項に同意します。"]
[]
[null,null,null,"●","別表（伴走船）"]
[null,null,null,null,null,null,null,null,null,null,null,null,null,"営業船",null,null,null,null,null,null,null,null,"伴走船A",null,null,null,null,null,null,null,null,"伴走船B",null,null,null,null,null,null,null,null,"伴走船C"]
[null,null,null,null,"船名",null,null,null,null,null,null,null,null,{"$f":"基礎情報!E18","v":"船名を入力してください"},null,null,null,null,null,null,null,null,"船名を入力してください",null,null,null,null,null,null,null,null,"船名を入力してください",null,null,null,null,null,null,null,null,"船名を入力してください"]
[null,null,null,null,"船舶番号",null,null,null,null,null,null,null,null,{"$f":"基礎情報!E21","v":"XXX"},null,"-",{"$f":"基礎情報!H21","v":"XXXXX"},null,null,null,null,null,"XXX",null,"-","XXXXX",null,null,null,null,null,"XXX",null,"-","XXXXX",null,null,null,null,null,"XXX",null,"-","XXXXX"]
[null,null,null,null,"認定番号",null,null,null,null,null,null,null,null,"ー",null,null,null,null,null,null,null,null,"認定番号を入力してください",null,null,null,null,null,null,null,null,"認定番号を入力してください",null,null,null,null,null,null,null,null,"認定番号を入力してください"]
[null,null,null,null,"搭載可能人員\n（最大搭載人員＋要救助者用別枠定員）",null,null,null,null,null,null,null,null,{"$f":"oIFS(基礎情報!E24=\"平水区域\",基礎情報!J30,基礎情報!E24=\"沿海区域\",基礎情報!AF30,基礎情報!E24=\"選択してください\",0)","v":0},null,null,null,null,null,null,null,null,0,null,null,null,null,null,null,null,null,0,null,null,null,null,null,null,null,null,0]
[null,null,null,null,"※４隻以上の船舶を伴走船として申告する場合、操作手順書の11ページを確認してください。"]
[]
[]
[]
[null,null,"●","特例③ 救助船を配備する船舶"]
[]
[null,null,null,"●",{"$f":"\"営業船が、\"&基礎情報!S58&\"の期間において航行時に配備する救助船の遵守事項\"","v":"営業船が、12/13～3/20の期間において航行時に配備する救助船の遵守事項"}]
[null,null,null,null,"＜遵守事項＞"]
[null,null,null,null,{"$f":"\"営業船（\"&基礎情報!E18&\"、船舶番号\"&基礎情報!E21&\"-\"&基礎情報!H21&\"）は、海域\"&oTEXTJOIN(\",\",TRUE,基礎情報!E43,基礎情報!E44,基礎情報!E45,基礎情報!E46,基礎情報!E47)&\"（\"&基礎情報!E24&\"）を航行する際、別表（救助船）に掲げる船舶（以下「救助船」という。）を配備する。\"","v":"営業船（船名を入力してください、船舶番号XXX-XXXXX）は、海域6（選択してください）を航行する際、別表（救助船）に掲げる船舶（以下「救助船」という。）を配備する。"}]
[null,null,null,null,"この場合、営業船及び救助船の船員、旅客及びその他乗船者を含め搭載可能となる人数は別表に従った人数とし、営業船の船舶所有者の責任において、救助船には下記の事項を遵守させる。"]
[null,null,null,null," ・営業船の航路が、救助船の航行区域内であること"]
[null,null,null,null," ・救助船は、営業船が航行する間、営業船から救助の要請があった場合に直ちに救助に向かう位置で待機していること"]
[null,null,null,null," ・救助船には、救助時に旅客の搭載しないこと"]
[null,null,null,null," ・救助船には、船長のほか救助を補佐する者１名以上が乗船すること"]
[]
[null,null,null,null,false,"上記の全ての遵守事項に同意します。"]
[]
[null,null,null,"●","別表（救助船）"]
[null,null,null,null,null,null,null,null,null,null,null,null,null,"救助船"]
[null,null,null,null,"船名",null,null,null,null,null,null,null,null,"船名を入力してください"]
[null,null,null,null,"船舶番号",null,null,null,null,null,null,null,null,"XXX",null,"-","XXXXX"]
[null,null,null,null,"救助船の係留場所",null,null,null,null,null,null,null,null,"係留場所を入力してください"]
[null,null,null,null,"認定番号",null,null,null,null,null,null,null,null,"認定番号を入力してください"]
[null,null,null,null,"搭載可能人員\n（最大搭載人員＋要救助者者別枠定員）",null,null,null,null,null,null,null,null,0]
[null,null,null,null,"※２隻以上の船舶を救助船として申告する場合、操作手順書の12ページを確認してください。"]
[]
[]
[]
[null,null,"●","特例④ 船内に浸水しないように措置された船舶",null,null,null,null,null,null,null,null,null,null,null,null,null,null,null,"※水温15℃以上20℃未満の水域を航行する場合に限定して適用可能"]
[]
[null,null,null,"●","船舶構造"]
[null,null,null,null,{"$f":"OR(基礎情報!E33,基礎情報!E34)","v":false},"営業船は水密全通甲板（又は不沈性及び安定性）を有する船舶である。"]
[null,null,null,null,"※特例④のみを選択した場合、水温10℃未満や水温15℃未満の水域を航行する場合の申告が不足しています。"]
[null,null,null,null,"この場合、水温10℃未満や水温15℃未満の水域を航行する場合は特例①（救命いかだ等の搭載が必要な水域を航行しないこと）が申告書に自動で出力されます。"]
[]
[]
[null,null,"●","特例⑤ 母港から5海里を超えて航行しない船舶",null,null,null,null,null,null,null,null,null,null,null,null,null,null,null,"※水温15℃以上20℃未満の水域を航行する場合に限定して適用可能"]
[]
[null,null,null,"●","母港のある都道府県名"]
[null,null,null,null,"都道府県",null,null,null,null,null,null,null,"市区町村 ※リストにない場合、省略可"]
[null,null,null,null,"選択してください",null,null,null,null,null,null,null,"選択してください"]
[]
[null,null,null,null,"営業船の母港"]
[null,null,null,null,"営業船の母港を入力してください"]
[null,null,null,null,"※２か所以上の母港を設定する場合、操作手順書の14ページを確認してください。"]
[null,null,null,null,"※特例⑤のみを選択した場合、水温10℃未満や水温15℃未満の水域を航行する場合の申告が不足しています。"]
[null,null,null,null,"この場合、水温10℃未満や水温15℃未満の水域を航行する場合は特例①（救命いかだ等の搭載が必要な水域を航行しないこと）が申告書に自動で出力されます。"]

{"sheet":"水温③","index":4,"n_rows":76,"n_cols":44,"rows_kept":76,"cut":false,"hidden":true,"merged":[[17,4,17,48],[53,4,53,12],[53,13,53,21],[49,13,49,21],[50,4,50,12],[50,13,50,21],[51,4,51,12],[51,13,51,14],[51,16,51,18],[52,4,52,12],[52,13,52,21],[30,4,30,12],[30,13,30,21],[30,22,30,30],[30,31,30,39],[30,40,30,48],[74,4,74,28],[71,4,71,9],[71,12,71,20],[54,4,54,12],[54,13,54,21],[28,31,28,32],[28,34,28,36],[28,40,28,41],[28,43,28,45],[29,4,29,12],[29,13,29,21],[29,22,29,30],[29,31,29,39],[29,40,29,48],[21,4,21,48],[44,4,44,48],[26,13,26,21],[26,22,26,30],[26,31,26,39],[26,40,26,48],[27,4,27,12],[27,13,27,21],[27,22,27,30],[27,31,27,39],[27,40,27,48],[28,4,28,12],[28,13,28,14],[28,16,28,18],[28,22,28,23],[28,25,28,27]]}
[]
[]
[null,null,"■水温③（航行する水域に水温15℃以上20℃未満となる水域が含まれる時期（水温①、水温②の時期を除く。））の詳細情報"]
[]
[null,null,"●","特例① 一定の水温を下回る時期に航行しない船舶"]
[]
[null,null,null,"●",{"$f":"\"営業船が、\"&基礎情報!AK58&\"の期間において航行時に講じる安全対策（特例②、③、④、⑤のいずれかの特例を講じて航行する場合は除く）\"","v":"営業船が、該当期間なしの期間において航行時に講じる安全対策（特例②、③、④、⑤のいずれかの特例を講じて航行する場合は除く）"}]
[null,null,null,null,false,"救命いかだ等の搭載が必要となる水域を航行しない。"]
[null,null,null,null,false,"平水区域以外を航行しない。"]
[]
[]
[]
[null,null,"●","特例② 伴走船と共に航行する船舶"]
[]
[null,null,null,"●",{"$f":"\"営業船が、\"&基礎情報!AK58&\"の期間において伴走船を伴い航行する際の遵守事項\"","v":"営業船が、該当期間なしの期間において伴走船を伴い航行する際の遵守事項"}]
[null,null,null,null,"【遵守事項】"]
[null,null,null,null,{"$f":"\"営業船（\"&基礎情報!E18&\"、船舶番号\"&基礎情報!E21&\"-\"&基礎情報!H21&\"）は、海域\"&oTEXTJOIN(\",\",TRUE,基礎情報!E43,基礎情報!E44,基礎情報!E45,基礎情報!E46,基礎情報!E47)&\"（\"&基礎情報!E24&\"）を航行する際、別表（伴走船）に掲げる船舶（以下「伴走船」という。）と共に航行する。\"","v":"営業船（船名を入力してください、船舶番号XXX-XXXXX）は、海域6（選択してください）を航行する際、別表（伴走船）に掲げる船舶（以下「伴走船」という。）と共に航行する。"}]
[null,null,null,null,"\n営業船の船舶所有者の責任において、伴走船には下記の事項を遵守させる。"]
[null,null,null,null,"・３隻以内の伴走船と共に航行すること"]
[null,null,null,null,"・伴走船の搭載人員は、別表の搭載可能人員を超えることなく、営業船の搭載人員分を搭載（救助）できるようにすること"]
[null,null,null,null,"・伴走船が、出航から帰港まで営業船を常に視認でき、かつ、万が一乗客が水中待機した場合であっても早急に救助できる位置を航行すること"]
[null,null,null,null,"・伴走船には、船長のほか救助を補佐する者１名以上が乗船すること\n　（なお、船員以外の者を補佐人として指定する場合、船長はその者に対し、発航前にその旨を説明し理解を得ること）"]
[]
[null,null,null,null,false,"上記の全ての遵守事項に同意します。"]
[]
[null,null,null,"●","別表（伴走船）"]
[null,null,null,null,null,null,null,null,null,null,null,null,null,"営業船",null,null,null,null,null,null,null,null,"伴走船A",null,null,null,null,null,null,null,null,"伴走船B",null,null,null,null,null,null,null,null,"伴走船C"]
[null,null,null,null,"船名",null,null,null,null,null,null,null,null,{"$f":"基礎情報!E18","v":"船名を入力してください"},null,null,null,null,null,null,null,null,"船名を入力してください",null,null,null,null,null,null,null,null,"船名を入力してください",null,null,null,null,null,null,null,null,"船名を入力してください"]
[null,null,null,null,"船舶番号",null,null,null,null,null,null,null,null,{"$f":"基礎情報!E21","v":"XXX"},null,"-",{"$f":"基礎情報!H21","v":"XXXXX"},null,null,null,null,null,"XXX",null,"-","XXXXX",null,null,null,null,null,"XXX",null,"-","XXXXX",null,null,null,null,null,"XXX",null,"-","XXXXX"]
[null,null,null,null,"認定番号",null,null,null,null,null,null,null,null,"ー",null,null,null,null,null,null,null,null,"認定番号を入力してください",null,null,null,null,null,null,null,null,"認定番号を入力してください",null,null,null,null,null,null,null,null,"認定番号を入力してください"]
[null,null,null,null,"搭載可能人員\n（最大搭載人員＋要救助者用別枠定員）",null,null,null,null,null,null,null,null,{"$f":"oIFS(基礎情報!E24=\"平水区域\",基礎情報!J30,基礎情報!E24=\"沿海区域\",基礎情報!AF30,基礎情報!E24=\"選択してください\",0)","v":0},null,null,null,null,null,null,null,null,0,null,null,null,null,null,null,null,null,0,null,null,null,null,null,null,null,null,0]
[null,null,null,null,"※４隻以上の船舶を伴走船として申告する場合、操作手順書の11ページを確認してください。"]
[]
[]
[]
[null,null,"●","特例③ 救助船を配備する船舶"]
[]
[null,null,null,"●",{"$f":"\"営業船が、\"&基礎情報!S58&\"の期間において航行時に配備する救助船の遵守事項\"","v":"営業船が、12/13～3/20の期間において航行時に配備する救助船の遵守事項"}]
[null,null,null,null,"＜遵守事項＞"]
[null,null,null,null,{"$f":"\"営業船（\"&基礎情報!E18&\"、船舶番号\"&基礎情報!E21&\"-\"&基礎情報!H21&\"）は、海域\"&oTEXTJOIN(\",\",TRUE,基礎情報!E43,基礎情報!E44,基礎情報!E45,基礎情報!E46,基礎情報!E47)&\"（\"&基礎情報!E24&\"）を航行する際、別表（救助船）に掲げる船舶（以下「救助船」という。）を配備する。\"","v":"営業船（船名を入力してください、船舶番号XXX-XXXXX）は、海域6（選択してください）を航行する際、別表（救助船）に掲げる船舶（以下「救助船」という。）を配備する。"}]
[null,null,null,null,"この場合、営業船及び救助船の船員、旅客及びその他乗船者を含め搭載可能となる人数は別表に従った人数とし、営業船の船舶所有者の責任において、救助船には下記の事項を遵守させる。"]
[null,null,null,null," ・営業船の航路が、救助船の航行区域内であること"]
[null,null,null,null," ・救助船は、営業船が航行する間、営業船から救助の要請があった場合に直ちに救助に向かう位置で待機していること"]
[null,null,null,null," ・救助船には、救助時に旅客の搭載しないこと"]
[null,null,null,null," ・救助船には、船長のほか救助を補佐する者１名以上が乗船すること"]
[]
[null,null,null,null,false,"上記の全ての遵守事項に同意します。"]
[]
[null,null,null,"●","別表（救助船）"]
[null,null,null,null,null,null,null,null,null,null,null,null,null,"救助船"]
[null,null,null,null,"船名",null,null,null,null,null,null,null,null,"船名を入力してください"]
[null,null,null,null,"船舶番号",null,null,null,null,null,null,null,null,"XXX",null,"-","XXXXX"]
[null,null,null,null,"救助船の係留場所",null,null,null,null,null,null,null,null,"係留場所を入力してください"]
[null,null,null,null,"認定番号",null,null,null,null,null,null,null,null,"認定番号を入力してください"]
[null,null,null,null,"搭載可能人員\n（最大搭載人員＋要救助者用別枠定員）",null,null,null,null,null,null,null,null,0]
[null,null,null,null,"※２隻以上の船舶を救助船として申告する場合、操作手順書の12ページを確認してください。"]
[]
[]
[]
[null,null,"●","特例④ 船内に浸水しないように措置された船舶"]
[]
[null,null,null,"●","船舶構造"]
[null,null,null,null,{"$f":"OR(基礎情報!E33,基礎情報!E34)","v":false},"営業船は水密全通甲板（又は不沈性及び安定性）を有する船舶である。"]
[null,null,null,null,"※特例④のみを選択した場合、特例①、②、③、⑤の選択は不要です。"]
[null,null,null,null,"そのため、特例①、②、③、⑤を選択したとしても、特例④のみが申告書に出力されます。"]
[]
[]
[null,null,"●","特例⑤ 母港から5海里を超えて航行しない船舶"]
[]
[null,null,null,"●","母港のある都道府県名"]
[null,null,null,null,"都道府県",null,null,null,null,null,null,null,"市区町村 ※リストにない場合、省略可"]
[null,null,null,null,"選択してください",null,null,null,null,null,null,null,"選択してください"]
[]
[null,null,null,null,"営業船の母港"]
[null,null,null,null,"営業船の母港を入力してください"]
[null,null,null,null,"※２か所以上の母港を設定する場合、操作手順書の14ページを確認してください。"]

{"sheet":"マップ","index":5,"n_rows":1,"n_cols":2,"rows_kept":1,"cut":false,"hidden":true,"merged":[[4,1,77,75],[3,14,3,25],[3,26,3,43],[3,44,3,59],[3,60,3,72],[1,14,1,25],[1,26,1,43],[1,44,1,59],[1,60,1,72],[2,14,2,25],[2,26,2,43],[2,44,2,59],[2,60,2,72]]}
[null,"※全島表示しておりません。対象箇所がない場合、別途問い合わせください。"]

{"sheet":"申告書","index":6,"n_rows":162,"n_cols":10,"rows_kept":162,"cut":false,"hidden":false,"merged":[[86,1,86,3],[86,4,86,9],[104,1,104,3],[104,4,104,9],[136,1,136,3],[136,4,136,9],[151,1,151,3],[151,4,151,9],[72,6,72,7],[72,8,72,9],[73,1,73,3],[73,4,73,5],[73,6,73,7],[73,8,73,9],[74,1,74,3],[74,4,74,5],[74,6,74,7],[74,8,74,9],[90,1,90,3],[90,4,90,5],[90,6,90,7],[90,8,90,9],[91,1,91,3],[91,4,91,5],[18,1,18,2],[5,5,5,6],[6,5,6,6],[7,5,7,6],[8,5,8,6],[10,1,10,9],[13,1,13,2],[14,1,14,2],[15,1,15,2],[16,1,17,2],[6,7,6,9],[7,7,7,9],[91,6,91,7],[91,8,91,9],[89,1,89,3],[89,4,89,5],[89,6,89,7],[89,8,89,9],[96,1,96,3],[96,4,96,9],[92,1,92,3],[92,4,92,5],[92,6,92,7],[92,8,92,9],[93,1,93,3],[93,4,93,5],[93,6,93,7],[93,8,93,9],[109,1,109,3],[109,4,109,5],[109,6,109,7],[109,8,109,9],[107,1,107,3],[107,4,107,5],[107,6,107,7],[107,8,107,9],[97,1,97,3],[98,1,98,3],[98,4,98,9],[97,4,97,9],[108,1,108,3],[108,4,108,5],[108,6,108,7],[108,8,108,9],[161,1,161,3],[161,4,161,9],[116,4,116,9],[115,4,115,9],[114,1,114,3],[114,4,114,9],[110,1,110,3],[110,4,110,5],[110,6,110,7],[110,8,110,9],[111,1,111,3],[111,4,111,5],[111,6,111,7],[111,8,111,9],[153,1,153,9],[154,1,154,3],[154,4,154,9],[146,1,146,3],[146,4,146,9],[158,1,158,3],[158,4,158,9],[155,1,155,3],[155,4,155,9],[156,1,156,3],[156,4,156,9],[157,1,157,3],[157,4,157,9],[138,1,138,9],[139,4,139,9],[140,1,140,3],[140,4,140,9],[139,1,139,3],[141,1,141,3],[141,4,141,9],[142,1,142,3],[142,4,142,9],[143,1,143,3],[143,4,143,9],[131,4,131,9],[128,1,128,3],[128,4,128,9],[131,1,131,3],[115,1,115,3],[116,1,116,3],[123,1,123,9],[124,1,124,3],[124,4,124,9],[125,1,125,3],[125,4,125,9],[126,1,126,3],[126,4,126,9],[127,1,127,3],[127,4,127,9],[121,1,121,3],[121,4,121,9],[21,1,21,9],[35,1,35,9],[43,1,43,9],[50,1,50,9],[57,1,57,9],[80,4,80,9],[79,4,79,9],[78,4,78,9],[44,1,48,9],[51,1,55,9],[58,1,62,9],[71,1,71,3],[71,4,71,5],[71,6,71,7],[71,8,71,9],[72,1,72,3],[78,1,78,3],[75,1,75,3],[75,4,75,5],[75,6,75,7],[75,8,75,9],[79,1,79,3],[80,1,80,3],[72,4,72,5],[68,1,68,3],[68,4,68,9],[26,7,26,9],[24,7,24,9],[23,7,23,9],[40,7,40,9],[38,7,38,9],[37,7,37,9],[33,7,33,9],[31,7,31,9],[30,7,30,9],[28,1,28,9]]}
[]
[]
[null,"位置保持型膨脹式救命いかだ等の搭載を要しない方法を利用するための申告書"]
[]
[null,"　　　　　　　殿"]
[null,null,null,null,null,"提出日",null,"西暦　 　　　年　　　月 　　日"]
[null,null,null,null,null,"住所",null,{"$f":"IF(基礎情報!E10<>\"\",基礎情報!E10,\"\")","v":"例）東京都千代田区九段北 4－1－3 飛栄九段北ビル5階"}]
[null,null,null,null,null,"船舶所有者\n氏名又は名称",null,{"$f":"IF(基礎情報!E7<>\"\",基礎情報!E7,\"\")","v":"所有者氏名又は名称を入力してください"}]
[null,null,null,null,null,"電話番号",null,{"$f":"IF(基礎情報!E13<>\"\",基礎情報!E13,\"\")&\"-\"&IF(基礎情報!I13<>\"\",基礎情報!I13,\"\")&\"-\"&IF(基礎情報!M13<>\"\",基礎情報!M13,\"\")","v":"XXX-XXXX-XXXX"}]
[]
[null,"　救命設備規則第57条第３項、第58条第１項、第69条第２項又は第69条の２第１項（総トン数20トン未満の小型船舶にあっては小型船舶安全規則第58条第３項）に規定する水温その他航海の態様を次のとおり申告します。\n　なお、本申告書の記載事項に変更が生じた場合は、最寄りの検査機関に改めて本様式により申告書を提出します。"]
[]
[null,"１　所有者の船舶情報（本船）"]
[null,"船名",null,{"$f":"基礎情報!E18","v":"船名を入力してください"}]
[null,"船舶番号",null,{"$f":"基礎情報!E21&\"-\"&基礎情報!H21","v":"XXX-XXXXX"}]
[null,"航行区域",null,{"$f":"IF(基礎情報!E24=\"平水区域\",\"☑\",\"□\")&\"平水区域　　　　　　\"&IF(基礎情報!E24=\"沿海区域\",\"☑\",\"□\")&\"沿海区域\"","v":"□平水区域　　　　　　□沿海区域"}]
[null,"最大搭載人員",null,"計",{"$f":"SUM(F18,H18,J18)","v":0}]
[null,null,null,"（内訳）","旅客",{"$f":"oIFS(基礎情報!E24=\"平水区域\",基礎情報!J27,基礎情報!E24=\"沿海区域\",基礎情報!AF27,基礎情報!E24=\"選択してください\",\"\")","v":""},"船員",{"$f":"oIFS(基礎情報!E24=\"平水区域\",基礎情報!J28,基礎情報!E24=\"沿海区域\",基礎情報!AF28,基礎情報!E24=\"選択してください\",\"\")","v":""},"その他\n乗船者",{"$f":"oIFS(基礎情報!E24=\"平水区域\",基礎情報!J29,基礎情報!E24=\"沿海区域\",基礎情報!AF29,基礎情報!E24=\"選択してください\",\"\")","v":""}]
[null,"船内に浸水しない\n構造の要件",null,{"$f":"IF(基礎情報!E33,\"☑\",\"□\") & 基礎情報!F33 &\"　　\"&IF(基礎情報!E34,\"☑\",\"□\") & 基礎情報!F34","v":"□水密全通甲板を有する船舶　　□不沈性及び安定性を有する船舶"}]
[]
[null,"２　申告する航海の態様"]
[null,{"$f":"\"水温①（航行する水域に水温10℃未満となる水域が含まれる時期）\n　\"&IF(OR(基礎情報!BD49=\"なし\",基礎情報!BD49=\"\"),\"該当期間なし\",IFERROR(TEXT(基礎情報!BD49,\"m月d日\")&\"～\"&TEXT(基礎情報!BE49,\"m月d日\"),\"\"))","v":"水温①（航行する水域に水温10℃未満となる水域が含まれる時期）\n　12月13日～3月20日"}]
[null,{"$f":"IF(B45=\"-\",\"□\",IF(基礎情報!W59,\"☑\",\"□\"))","v":"☑"},"特例①","　一定の水温を下回る時期に航行しない"]
[null,{"$f":"IF(B45=\"-\",\"□\",IF(基礎情報!W60,\"☑\",\"□\"))","v":"□"},"特例②","　伴走船と共に航行する",null,null,null,{"$f":"IF(AND(基礎情報!W60=TRUE,水温①!E24=FALSE),HYPERLINK(\"#水温①!E23\",\"※水温①の特例②遵守事項に同意してください。\"),\"\")","v":""}]
[null,{"$f":"IF(B45=\"-\",\"□\",IF(基礎情報!W61,\"☑\",\"□\"))","v":"□"},"特例③","　救助船を配備する",null,null,null,{"$f":"IF(AND(基礎情報!W61=TRUE,水温①!E47=FALSE),HYPERLINK(\"#水温①!E46\",\"※水温①の特例③遵守事項に同意してください。\"),\"\")","v":""}]
[null,{"$f":"IF(B45=\"-\",\"□\",IF(基礎情報!W62,\"☑\",\"□\"))","v":"□"},"特例④","　船内に浸水しない構造を有する"]
[null,{"$f":"IF(B45=\"-\",\"□\",IF(基礎情報!W63,\"☑\",\"□\"))","v":"□"},"特例⑤","　母港から５海里を超えて航行しない",null,null,null,{"$f":"IF(基礎情報!W63=TRUE,IF(OR(水温①!E75=\"営業船の母港を入力してください\",水温①!E75=\"\"),HYPERLINK(\"#水温①!E74\",\"※水温①の「営業船の母港」を入力してください。\"),\"\"),\"\")","v":""}]
[]
[null,{"$f":"\"水温②（航行する水域に水温10℃以上15℃未満となる水域が含まれる時期）\n　\"&IF(OR(基礎情報!BF49=\"なし\",基礎情報!BF49=\"\",基礎情報!E24=\"平水区域\"),\"該当期間なし\",IFERROR(IF(AND(基礎情報!BF49=IF(ISNUMBER(基礎情報!BD49),基礎情報!BD49-1,0),IF(ISNUMBER(基礎情報!BE49),基礎情報!BE49+1,0)=基礎情報!BG49),TEXT(基礎情報!BE49+1,\"m月d日\")&\"～\"&TEXT(基礎情報!BF49,\"m月d日\"),TEXT(基礎情報!BF49,\"m月d日\")&\"～\"&IF(基礎情報!BD49=\"なし\",\"\",TEXT(基礎情報!BD49-1,\"m月d日\")&\"、\"&TEXT(基礎情報!BE49+1,\"m月d日\")&\"～\")&TEXT(基礎情報!BG49,\"m月d日\")),\"\"))","v":"水温②（航行する水域に水温10℃以上15℃未満となる水域が含まれる時期）\n　該当期間なし"}]
[null,{"$f":"IF(B52=\"-\",\"□\",IF(基礎情報!AF59,\"☑\",\"□\"))","v":"□"},"特例①","　一定の水温を下回る時期に航行しない"]
[null,{"$f":"IF(B52=\"-\",\"□\",IF(基礎情報!AF60,\"☑\",\"□\"))","v":"□"},"特例②","　伴走船と共に航行する",null,null,null,{"$f":"IF(B52=\"-\",\"\",IF(AND(基礎情報!AF60=TRUE,水温②!E24=FALSE),HYPERLINK(\"#水温②!E23\",\"※水温②の特例②遵守事項に同意してください。\"),\"\"))","v":""}]
[null,{"$f":"IF(B52=\"-\",\"□\",IF(基礎情報!AF61,\"☑\",\"□\"))","v":"□"},"特例③","　救助船を配備する",null,null,null,{"$f":"IF(B52=\"-\",\"\",IF(AND(基礎情報!AF61=TRUE,水温②!E47=FALSE),HYPERLINK(\"#水温②!E46\",\"※水温②の特例③遵守事項に同意してください。\"),\"\"))","v":""}]
[null,{"$f":"IF(B52=\"-\",\"□\",IF(基礎情報!AF62,\"☑\",\"□\"))","v":"□"},"特例④","　船内に浸水しない構造を有する"]
[null,{"$f":"IF(B52=\"-\",\"□\",IF(基礎情報!AF63,\"☑\",\"□\"))","v":"□"},"特例⑤","　母港から５海里を超えて航行しない",null,null,null,{"$f":"IF(B52=\"-\",\"\",IF(基礎情報!AF63=TRUE,IF(OR(水温②!E75=\"営業船の母港を入力してください\",水温②!E75=\"\"),HYPERLINK(\"#水温②!E74\",\"※水温②の「営業船の母港」を入力してください。\"),\"\"),\"\"))","v":""}]
[]
[null,{"$f":"\"水温③（航行する水域に水温15℃以上20℃未満となる水域が含まれる時期）\n　\"&IF(OR(基礎情報!BH49=\"なし\",基礎情報!BH49=\"\",基礎情報!E24=\"平水区域\"),\"該当期間なし\",IFERROR(IF(AND(基礎情報!BH49=IF(ISNUMBER(基礎情報!BF49),基礎情報!BF49-1,0),IF(ISNUMBER(基礎情報!BG49),基礎情報!BG49+1,0)=基礎情報!BI49),TEXT(基礎情報!BG49+1,\"m月d日\")&\"～\"&TEXT(基礎情報!BH49,\"m月d日\"),TEXT(基礎情報!BH49,\"m月d日\")&\"～\"&IF(基礎情報!BF49=\"なし\",\"\",TEXT(基礎情報!BF49-1,\"m月d日\")&\"、\"&TEXT(基礎情報!BG49+1,\"m月d日\")&\"～\")&TEXT(基礎情報!BI49,\"m月d日\")),\"\"))","v":"水温③（航行する水域に水温15℃以上20℃未満となる水域が含まれる時期）\n　該当期間なし"}]
[null,{"$f":"IF(B59=\"-\",\"□\",IF(基礎情報!AO59,\"☑\",\"□\"))","v":"□"},"特例①","　一定の水温を下回る時期に航行しない"]
[null,{"$f":"IF(B59=\"-\",\"□\",IF(基礎情報!AO60,\"☑\",\"□\"))","v":"□"},"特例②","　伴走船と共に航行する",null,null,null,{"$f":"IF(B59=\"-\",\"\",IF(AND(基礎情報!AO60=TRUE,水温③!E24=FALSE),HYPERLINK(\"#水温③!E23\",\"※水温③の特例②遵守事項に同意してください。\"),\"\"))","v":""}]
[null,{"$f":"IF(B59=\"-\",\"□\",IF(基礎情報!AO61,\"☑\",\"□\"))","v":"□"},"特例③","　救助船を配備する",null,null,null,{"$f":"IF(B59=\"-\",\"\",IF(AND(基礎情報!AO61=TRUE,水温③!E47=FALSE),HYPERLINK(\"#水温③!E46\",\"※水温③の特例③遵守事項に同意してください。\"),\"\"))","v":""}]
[null,{"$f":"IF(B59=\"-\",\"□\",IF(基礎情報!AO62,\"☑\",\"□\"))","v":"□"},"特例④","　船内に浸水しない構造を有する"]
[null,{"$f":"IF(B59=\"-\",\"□\",IF(基礎情報!AO63,\"☑\",\"□\"))","v":"□"},"特例⑤","　母港から５海里を超えて航行しない",null,null,null,{"$f":"IF(B59=\"-\",\"\",IF(基礎情報!AO63=TRUE,IF(OR(水温③!E75=\"営業船の母港を入力してください\",水温③!E75=\"\"),HYPERLINK(\"#水温③!E74\",\"※水温③の「営業船の母港」を入力してください。\"),\"\"),\"\"))","v":""}]
[]
[null,"３　船舶の航行区域の水温その他航海の態様（具体的な内容）"]
[null,{"$f":"B22","v":"水温①（航行する水域に水温10℃未満となる水域が含まれる時期）\n　12月13日～3月20日"}]
[null,{"$f":"IF(RIGHT(B44,6)=\"該当期間なし\",\"-\",申告内容!B7)","v":"本船（船名を入力してください、船舶番号XXX-XXXXX）は、旅客を搭載して、水域6（選択してください）を航行しない。"}]
[]
[]
[]
[]
[]
[null,{"$f":"B29","v":"水温②（航行する水域に水温10℃以上15℃未満となる水域が含まれる時期）\n　該当期間なし"}]
[null,{"$f":"IF(RIGHT(B51,6)=\"該当期間なし\",\"-\",申告内容!C7)","v":"-"}]
[]
[]
[]
[]
[]
[null,{"$f":"B36","v":"水温③（航行する水域に水温15℃以上20℃未満となる水域が含まれる時期）\n　該当期間なし"}]
[null,{"$f":"IF(RIGHT(B58,6)=\"該当期間なし\",\"-\",申告内容!D7)","v":"-"}]
[]
[]
[]
[]
[]
[null,"別表（伴走船_水温①）"]
[]
[]
[null,"１　本船に搭載している伴走船との通信手段"]
[null,"通信設備の名称及び型式"]
[]
[null,"２　伴走船の船名、船舶番号、認定番号等"]
[null,null,null,null,"伴走船A",null,"伴走船B",null,"伴走船C"]
[null,"船名",null,null,{"$f":"IF(水温①!W28<>\"\",水温①!W28,\"\")","v":"船名を入力してください"},null,{"$f":"IF(水温①!AF28<>\"\",水温①!AF28,\"\")","v":"船名を入力してください"},null,{"$f":"IF(水温①!AO28<>\"\",水温①!AO28,\"\")","v":"船名を入力してください"}]
[null,"船舶番号",null,null,{"$f":"IF(AND(水温①!W29<>\"\",水温①!Z29<>\"\"),水温①!W29&\"-\"&水温①!Z29,\"\")","v":"XXX-XXXXX"},null,{"$f":"IF(AND(水温①!AF29<>\"\",水温①!AI29<>\"\"),水温①!AF29&\"-\"&水温①!AI29,\"\")","v":"XXX-XXXXX"},null,{"$f":"IF(AND(水温①!AO29<>\"\",水温①!AR29<>\"\"),水温①!AO29&\"-\"&水温①!AR29,\"\")","v":"XXX-XXXXX"}]
[null,"認定番号",null,null,{"$f":"IF(水温①!W30<>\"\",水温①!W30,\"\")","v":"認定番号を入力してください"},null,{"$f":"IF(水温①!AF30<>\"\",水温①!AF30,\"\")","v":"認定番号を入力してください"},null,{"$f":"IF(水温①!AO30<>\"\",水温①!AO30,\"\")","v":"認定番号を入力してください"}]
[null,"搭　　載　　可　　能　　人　員\n（最大搭載人員＋要救助者用別枠定員）",null,null,{"$f":"IF(水温①!W31<>\"\",水温①!W31,\"\")","v":0},null,{"$f":"IF(水温①!AF31<>\"\",水温①!AF31,\"\")","v":0},null,{"$f":"IF(水温①!AO31<>\"\",水温①!AO31,\"\")","v":0}]
[]
[null,"伴走船の船舶所有者の記名欄（伴走船の船舶所有者が本船の船舶所有者と異なる場合）"]
[null,"伴走船Aの船舶所有者"]
[null,"伴走船Bの船舶所有者"]
[null,"伴走船Cの船舶所有者"]
[]
[null,"別表（伴走船_水温②）"]
[]
[]
[null,"１　本船に搭載している伴走船との通信手段"]
[null,"通信設備の名称及び型式"]
[]
[null,"２　伴走船の船名、船舶番号、認定番号等"]
[null,null,null,null,"伴走船A",null,"伴走船B",null,"伴走船C"]
[null,"船名",null,null,{"$f":"IF(水温②!W28<>\"\",水温②!W28,\"\")","v":"船名を入力してください"},null,{"$f":"IF(水温②!AF28<>\"\",水温②!AF28,\"\")","v":"船名を入力してください"},null,{"$f":"IF(水温②!AO28<>\"\",水温②!AO28,\"\")","v":"船名を入力してください"}]
[null,"船舶番号",null,null,{"$f":"IF(AND(水温②!W29<>\"\",水温②!Z29<>\"\"),水温②!W29&\"-\"&水温②!Z29,\"\")","v":"XXX-XXXXX"},null,{"$f":"IF(AND(水温②!AF29<>\"\",水温②!AI29<>\"\"),水温②!AF29&\"-\"&水温②!AI29,\"\")","v":"XXX-XXXXX"},null,{"$f":"IF(AND(水温②!AO29<>\"\",水温②!AR29<>\"\"),水温②!AO29&\"-\"&水温②!AR29,\"\")","v":"XXX-XXXXX"}]
[null,"認定番号",null,null,{"$f":"IF(水温②!W30<>\"\",水温②!W30,\"\")","v":"認定番号を入力してください"},null,{"$f":"IF(水温②!AF30<>\"\",水温②!AF30,\"\")","v":"認定番号を入力してください"},null,{"$f":"IF(水温②!AO30<>\"\",水温②!AO30,\"\")","v":"認定番号を入力してください"}]
[null,"搭　　載　　可　　能　　人　員\n（最大搭載人員＋要救助者用別枠定員）",null,null,{"$f":"IF(水温②!W31<>\"\",水温②!W31,\"\")","v":0},null,{"$f":"IF(水温②!AF31<>\"\",水温②!AF31,\"\")","v":0},null,{"$f":"IF(水温②!AO31<>\"\",水温②!AO31,\"\")","v":0}]
[]
[null,"伴走船の船舶所有者の記名欄（伴走船の船舶所有者が本船の船舶所有者と異なる場合）"]
[null,"伴走船Aの船舶所有者"]
[null,"伴走船Bの船舶所有者"]
[null,"伴走船Cの船舶所有者"]
[]
[null,"別表（伴走船_水温③）"]
[]
[]
[null,"１　本船に搭載している伴走船との通信手段"]
[null,"通信設備の名称及び型式"]
[]
[null,"２　伴走船の船名、船舶番号、認定番号等"]
[null,null,null,null,"伴走船A",null,"伴走船B",null,"伴走船C"]
[null,"船名",null,null,{"$f":"IF(水温③!W28<>\"\",水温③!W28,\"\")","v":"船名を入力してください"},null,{"$f":"IF(水温③!AF28<>\"\",水温③!AF28,\"\")","v":"船名を入力してください"},null,{"$f":"IF(水温③!AO28<>\"\",水温③!AO28,\"\")","v":"船名を入力してください"}]
[null,"船舶番号",null,null,{"$f":"IF(AND(水温③!W29<>\"\",水温③!Z29<>\"\"),水温③!W29&\"-\"&水温③!Z29,\"\")","v":"XXX-XXXXX"},null,{"$f":"IF(AND(水温③!AF29<>\"\",水温③!AI29<>\"\"),水温③!AF29&\"-\"&水温③!AI29,\"\")","v":"XXX-XXXXX"},null,{"$f":"IF(AND(水温③!AO29<>\"\",水温③!AR29<>\"\"),水温③!AO29&\"-\"&水温③!AR29,\"\")","v":"XXX-XXXXX"}]
[null,"認定番号",null,null,{"$f":"IF(水温③!W30<>\"\",水温③!W30,\"\")","v":"認定番号を入力してください"},null,{"$f":"IF(水温③!AF30<>\"\",水温③!AF30,\"\")","v":"認定番号を入力してください"},null,{"$f":"IF(水温③!AO30<>\"\",水温③!AO30,\"\")","v":"認定番号を入力してください"}]
[null,"搭　　載　　可　　能　　人　員\n（最大搭載人員＋要救助者用別枠定員）",null,null,{"$f":"IF(水温③!W31<>\"\",水温③!W31,\"\")","v":0},null,{"$f":"IF(水温③!AF31<>\"\",水温③!AF31,\"\")","v":0},null,{"$f":"IF(水温③!AO31<>\"\",水温③!AO31,\"\")","v":0}]
[]
[null,"伴走船の船舶所有者の記名欄（伴走船の船舶所有者が本船の船舶所有者と異なる場合）"]
[null,"伴走船Aの船舶所有者"]
[null,"伴走船Bの船舶所有者"]
[null,"伴走船Cの船舶所有者"]
[]
[null,"別表（救助船_水温①）"]
[]
[null,"１　本船に搭載している救助船との通信手段"]
[null,"通信設備の名称及び型式"]
[]
[null,"２　救助船の船名、船舶番号、認定番号等"]
[null,null,null,null,"救助船"]
[null,"船名",null,null,{"$f":"IF(水温①!N51<>\"\",水温①!N51,\"\")","v":"船名を入力してください"}]
[null,"船舶番号",null,null,{"$f":"IF(AND(水温①!N52<>\"\",水温①!Q52<>\"\"),水温①!N52&\"-\"&水温①!Q52,\"\")","v":"XXX-XXXXX"}]
[null,"認定番号",null,null,{"$f":"IF(水温①!N54<>\"\",水温①!N54,\"\")","v":"認定番号を入力してください"}]
[null,"搭　　載　　可　　能　　人　員\n（最大搭載人員＋要救助者用別枠定員）",null,null,{"$f":"IF(水温①!N55<>\"\",水温①!N55,\"\")","v":0}]
[]
[null,"救助船の船舶所有者の記名欄（救助船の船舶所有者が本船の船舶所有者と異なる場合）"]
[null,"救助船の船舶所有者"]
[]
[null,"別表（救助船_水温②）"]
[]
[null,"１　本船に搭載している救助船との通信手段"]
[null,"通信設備の名称及び型式"]
[]
[null,"２　救助船の船名、船舶番号、認定番号等"]
[null,null,null,null,"救助船"]
[null,"船名",null,null,{"$f":"IF(水温②!N51<>\"\",水温②!N51,\"\")","v":"船名を入力してください"}]
[null,"船舶番号",null,null,{"$f":"IF(AND(水温②!N52<>\"\",水温②!Q52<>\"\"),水温②!N52&\"-\"&水温②!Q52,\"\")","v":"XXX-XXXXX"}]
[null,"認定番号",null,null,{"$f":"IF(水温②!N54<>\"\",水温②!N54,\"\")","v":"認定番号を入力してください"}]
[null,"搭　　載　　可　　能　　人　員\n（最大搭載人員＋要救助者用別枠定員）",null,null,{"$f":"IF(水温②!N55<>\"\",水温②!N55,\"\")","v":0}]
[]
[null,"救助船の船舶所有者の記名欄（救助船の船舶所有者が本船の船舶所有者と異なる場合）"]
[null,"救助船の船舶所有者"]
[]
[null,"別表（救助船_水温③）"]
[]
[null,"１　本船に搭載している救助船との通信手段"]
[null,"通信設備の名称及び型式"]
[]
[null,"２　救助船の船名、船舶番号、認定番号等"]
[null,null,null,null,"救助船"]
[null,"船名",null,null,{"$f":"IF(水温③!N51<>\"\",水温③!N51,\"\")","v":"船名を入力してください"}]
[null,"船舶番号",null,null,{"$f":"IF(AND(水温③!N52<>\"\",水温③!Q52<>\"\"),水温③!N52&\"-\"&水温③!Q52,\"\")","v":"XXX-XXXXX"}]
[null,"認定番号",null,null,{"$f":"IF(水温③!N54<>\"\",水温③!N54,\"\")","v":"認定番号を入力してください"}]
[null,"搭　　載　　可　　能　　人　員\n（最大搭載人員＋要救助者用別枠定員）",null,null,{"$f":"IF(水温③!N55<>\"\",水温③!N55,\"\")","v":0}]
[]
[null,"救助船の船舶所有者の記名欄（救助船の船舶所有者が本船の船舶所有者と異なる場合）"]
[null,"救助船の船舶所有者"]

{"sheet":"申告内容","index":7,"n_rows":24,"n_cols":27,"rows_kept":24,"cut":false,"hidden":true,"merged":[]}
["入力シート情報：本船",{"$f":"\"本船（\"&基礎情報!E18&\"、船舶番号\"&基礎情報!E21&\"-\"&基礎情報!H21&\"）\"","v":"本船（船名を入力してください、船舶番号XXX-XXXXX）"}]
["入力シート情報：航行区域",{"$f":"IF(基礎情報!E43<>\"\",基礎情報!E43,\"【未入力】\")&IF(基礎情報!E44<>\"\",\"、\"&基礎情報!E44,\"\")&IF(基礎情報!E45<>\"\",\"、\"&基礎情報!E45,\"\")&IF(基礎情報!E46<>\"\",\"、\"&基礎情報!E46,\"\")&IF(基礎情報!E47<>\"\",\"、\"&基礎情報!E47,\"\")","v":"6"}]
["入力シート情報：水域",{"$f":"基礎情報!E24","v":"選択してください"}]
["水温帯：母港",{"$f":"水温①!E75&\"（\"&水温①!E72&水温①!M72&\"）\"","v":"営業船の母港を入力してください（選択してください選択してください）"},{"$f":"水温②!E75&\"（\"&水温②!E72&水温②!M72&\"）\"","v":"営業船の母港を入力してください（選択してください選択してください）"},{"$f":"水温③!E75&\"（\"&水温③!E72&水温③!M72&\"）\"","v":"営業船の母港を入力してください（選択してください選択してください）"}]
["文末",{"$f":"IF(B10=\"TRUE,FALSE,FALSE,FALSE,FALSE\",\"\",\"\")&\nIF(水温①!E8=TRUE,\"当該水域のうち救命いかだ等の搭載が必要となる区域では\",\"\")&\nIF(水温①!E9=TRUE,\"当該水域のうち水温が10℃未満となる平水区域、沿海区域では\",\"\")&\nIF(E5>=13,\"旅客を搭載して航行しない。\",\"\")&\n IF(E5<=12,\"事業（海上運送法における人の運送を行う事業や遊漁船業）の用に供しない。\",\"\")","v":"事業（海上運送法における人の運送を行う事業や遊漁船業）の用に供しない。"},{"$f":"IF(C10=\"TRUE,FALSE,FALSE,FALSE,FALSE\",\"\",\"\")&\nIF(水温②!E8=TRUE,\"当該水域のうち救命いかだ等の搭載が必要となる区域では\",\"\")&\nIF(水温②!E9=TRUE,\"当該水域のうち沿海区域では\",\"\")&\nIF(E5>=13,\"旅客を搭載して航行しない。\",\"\")&\n IF(E5<=12,\"事業（海上運送法における人の運送を行う事業や遊漁船業）の用に供しない。\",\"\")","v":"事業（海上運送法における人の運送を行う事業や遊漁船業）の用に供しない。"},{"$f":"IF(D10=\"TRUE,FALSE,FALSE,FALSE,FALSE\",\"\",\"\")&\nIF(水温③!E8=TRUE,\"当該水域のうち救命いかだ等の搭載が必要となる区域では\",\"\")&\nIF(水温③!E9=TRUE,\"当該水域のうち沿海区域では\",\"\")&\nIF(E5>=13,\"旅客を搭載して航行しない。\",\"\")&\n IF(E5<=12,\"事業（海上運送法における人の運送を行う事業や遊漁船業）の用に供しない。\",\"\")","v":"事業（海上運送法における人の運送を行う事業や遊漁船業）の用に供しない。"},{"$f":"IF(基礎情報!E24=\"平水区域\",基礎情報!J30,0)+IF(基礎情報!E24=\"沿海区域\",基礎情報!AF30,0)","v":0}]
["対象列番号",{"$f":"MATCH(B10,E10:AA10,0)+COLUMN(D10)","v":{"$error":"#N/A"}},{"$f":"MATCH(C10,E10:AA10,0)+COLUMN(D10)","v":{"$error":"#N/A"}},{"$f":"MATCH(D10,E10:AA10,0)+COLUMN(D10)","v":{"$error":"#N/A"}}]
["【申告内容】",{"$f":"IFERROR(INDIRECT(ADDRESS(22,申告内容!B6,,,\"申告内容\")),B1&\"は、旅客を搭載して、水域\"&B2&\"（\"&B3&\"）を航行しない。\")","v":"本船（船名を入力してください、船舶番号XXX-XXXXX）は、旅客を搭載して、水域6（選択してください）を航行しない。"},{"$f":"IFERROR(INDIRECT(ADDRESS(23,申告内容!C6,,,\"申告内容\")),B1&\"は、旅客を搭載して、水域\"&B2&\"（\"&B3&\"）を航行しない。\")","v":"本船（船名を入力してください、船舶番号XXX-XXXXX）は、旅客を搭載して、水域6（選択してください）を航行しない。"},{"$f":"IFERROR(INDIRECT(ADDRESS(24,申告内容!D6,,,\"申告内容\")),B1&\"は、旅客を搭載して、水域\"&B2&\"（\"&B3&\"）を航行しない。\")","v":"本船（船名を入力してください、船舶番号XXX-XXXXX）は、旅客を搭載して、水域6（選択してください）を航行しない。"}]
["対象列番号",null,null,null,5,6,7,8,9,10,11,12,13,14,15,16,17,18,19,20,21,22,23,24,25,26,27]
[null,"水温①","水温②","水温③","特例①","特例②","特例③","特例④","特例⑤","特例①、特例②、特例③","特例②、特例③","特例①、特例③","特例①、特例②","特例①、特例②、特例③、特例⑤","特例②、特例③、特例⑤","特例①、特例③、特例⑤","特例①、特例⑤","特例③、特例⑤","特例①、特例②、特例⑤","特例②、特例⑤","特例①、特例②、特例③、特例④","特例②、特例③、特例④","特例①、特例③、特例④","特例①、特例④","特例③、特例④","特例①、特例②、特例④","特例②、特例④"]
["ALL",{"$f":"oTEXTJOIN(\",\",TRUE,B11:B15)","v":"False,False,False,False,False"},{"$f":"oTEXTJOIN(\",\",TRUE,C11:C15)","v":"False,False,False,False,False"},{"$f":"oTEXTJOIN(\",\",TRUE,D11:D15)","v":"False,False,False,False,False"},{"$f":"oTEXTJOIN(\",\",TRUE,E11:E15)","v":"True,False,False,False,False"},{"$f":"oTEXTJOIN(\",\",TRUE,F11:F15)","v":"False,True,False,False,False"},{"$f":"oTEXTJOIN(\",\",TRUE,G11:G15)","v":"False,False,True,False,False"},{"$f":"oTEXTJOIN(\",\",TRUE,H11:H15)","v":"False,False,False,True,False"},{"$f":"oTEXTJOIN(\",\",TRUE,I11:I15)","v":"False,False,False,False,True"},{"$f":"oTEXTJOIN(\",\",TRUE,J11:J15)","v":"True,True,True,False,False"},{"$f":"oTEXTJOIN(\",\",TRUE,K11:K15)","v":"False,True,True,False,False"},{"$f":"oTEXTJOIN(\",\",TRUE,L11:L15)","v":"True,False,True,False,False"},{"$f":"oTEXTJOIN(\",\",TRUE,M11:M15)","v":"True,True,False,False,False"},{"$f":"oTEXTJOIN(\",\",TRUE,N11:N15)","v":"True,True,True,False,True"},{"$f":"oTEXTJOIN(\",\",TRUE,O11:O15)","v":"False,True,True,False,True"},{"$f":"oTEXTJOIN(\",\",TRUE,P11:P15)","v":"True,False,True,False,True"},{"$f":"oTEXTJOIN(\",\",TRUE,Q11:Q15)","v":"True,False,False,False,True"},{"$f":"oTEXTJOIN(\",\",TRUE,R11:R15)","v":"False,False,True,False,True"},{"$f":"oTEXTJOIN(\",\",TRUE,S11:S15)","v":"True,True,False,False,True"},{"$f":"oTEXTJOIN(\",\",TRUE,T11:T15)","v":"False,True,False,False,True"},{"$f":"oTEXTJOIN(\",\",TRUE,U11:U15)","v":"True,True,True,True,False"},{"$f":"oTEXTJOIN(\",\",TRUE,V11:V15)","v":"False,True,True,True,False"},{"$f":"oTEXTJOIN(\",\",TRUE,W11:W15)","v":"True,False,True,True,False"},{"$f":"oTEXTJOIN(\",\",TRUE,X11:X15)","v":"True,False,False,True,False"},{"$f":"oTEXTJOIN(\",\",TRUE,Y11:Y15)","v":"False,False,True,True,False"},{"$f":"oTEXTJOIN(\",\",TRUE,Z11:Z15)","v":"True,True,False,True,False"},{"$f":"oTEXTJOIN(\",\",TRUE,AA11:AA15)","v":"False,True,False,True,False"}]
["特例①　一定の水温を下回る時期に航行しない",{"$f":"OR(水温①!E8,水温①!E9)","v":false},{"$f":"OR(水温②!E8,水温②!E9)","v":false},{"$f":"OR(水温③!E8,水温③!E9)","v":false},{"$f":"NOT(ISBLANK(E17))","v":true},{"$f":"NOT(ISBLANK(F17))","v":false},false,false,false,true,false,true,true,true,false,true,true,false,true,false,true,false,true,true,false,true,false]
["特例②　必ず航行時に伴走船を伴う",{"$f":"基礎情報!W60","v":false},{"$f":"基礎情報!AF60","v":false},{"$f":"基礎情報!AO60","v":false},{"$f":"NOT(ISBLANK(E18))","v":false},true,false,false,false,true,true,false,true,true,true,false,false,false,true,true,true,true,false,false,false,true,true]
["特例③　救助船を配備している",{"$f":"基礎情報!W61","v":false},{"$f":"基礎情報!AF61","v":false},{"$f":"基礎情報!AO61","v":false},false,false,true,false,false,true,true,true,false,true,true,true,false,true,false,false,true,true,true,false,true,false,false]
["特例④　船内に浸水しない構造を有する",{"$f":"水温①!E63","v":false},{"$f":"水温②!E63","v":false},{"$f":"水温③!E63","v":false},false,false,false,true,false,false,false,false,false,false,false,false,false,false,false,false,true,true,true,true,true,true,true]
["特例⑤　母港から５海里を超えて航行しない",{"$f":"基礎情報!W63","v":false},{"$f":"基礎情報!AF63","v":false},{"$f":"基礎情報!AO63","v":false},false,false,false,false,true,false,false,false,false,true,true,true,true,true,true,true,false,false,false,false,false,false,false]
["パターン分け"]
["特例①　一定の水温を下回る時期に航行しない",null,null,null,"❶",null,null,null,null,"❸",null,"❷","❷","❹",null,"❸","❷",null,"❸",null,"❹",null,"❸","❷",null,"❸"]
["特例②　必ず航行時に伴走船を伴う",null,null,null,null,"❶",null,null,null,"❷","❷",null,"❶","❸","❸",null,null,null,"❷","❷","❸","❸",null,null,null,"❷","❷"]
["特例③　救助船を配備している",null,null,null,null,null,"❶",null,null,"❶","❶","❶",null,"❷","❷","❷",null,"❷",null,null,"❷","❷","❷",null,"❷"]
["特例④　船内に浸水しない構造を有する",null,null,null,null,null,null,"❶",null,null,null,null,null,null,null,null,null,null,null,null,"❶","❶","❶","❶","❶","❶","❶"]
["特例⑤　母港から５海里を超えて航行しない",null,null,null,null,null,null,null,"❶",null,null,null,null,"❶","❶","❶","❶","❶","❶","❶"]
["水温①（航行する水域の中に水温10℃未満となる水域が含まれる時期）",null,null,null,{"$f":"B1&\"は、水域\"&B2&\"（\"&B3&\"）を航行する際、\"&B5","v":"本船（船名を入力してください、船舶番号XXX-XXXXX）は、水域6（選択してください）を航行する際、事業（海上運送法における人の運送を行う事業や遊漁船業）の用に供しない。"},{"$f":"B1&\"は、水域\"&B2&\"（\"&B3&\"（水温20℃以上となる水域を除く））を航行する際、別表（伴走船_水温①）に掲げる船舶（以下「伴走船」という。）と共に航行する。\"&\"\n\n\"&\"遵守事項\n・３隻以内の伴走船と共に航行すること\n・伴走船の搭載人員は、別表の搭載可能人員を超えることなく、本船の搭載人員分を搭載（救助）できるようにすること\n・伴走船が、出航から帰港まで本船を常に視認でき、かつ、万が一乗客が水中待機した場合であっても早急に救助できる位置を航行すること\n・伴走船には、船長のほか救助を補佐する者１名以上が乗船すること\n　（なお、船員以外の者を補佐人として指定する場合、船長はその者に対し、発航前にその旨を説明し理解を得ること）\"","v":"本船（船名を入力してください、船舶番号XXX-XXXXX）は、水域6（選択してください（水温20℃以上となる水域を除く））を航行する際、別表（伴走船_水温①）に掲げる船舶（以下「伴走船」という。）と共に航行する。\n\n遵守事項\n・３隻以内の伴走船と共に航行すること\n・伴走船の搭載人員は、別表の搭載可能人員を超えることなく、本船の搭載人員分を搭載（救助）できるようにすること\n・伴走船が、出航から帰港まで本船を常に視認でき、かつ、万が一乗客が水中待機した場合であっても早急に救助できる位置を航行すること\n・伴走船には、船長のほか救助を補佐する者１名以上が乗船すること\n　（なお、船員以外の者を補佐人として指定する場合、船長はその者に対し、発航前にその旨を説明し理解を得ること）"},{"$f":"B1&\"は、水域\"&B2&\"（\"&B3&\"（水温20℃以上となる水域を除く））を航行する際、別表（救助船_水温①）に掲げる船舶（以下「救助船」という。）を配備する。\"&\"\n\n\"&\"遵守事項\n・本船の航路は、救助船の航行区域内とすること\n・救助船は、本船が航行する間、本船から救助の要請があった場合に直ちに救助に向かう位置で待機していること\n・救助船には、救助時に向かう際は旅客を搭載しないこと\n・救助船には、船長のほか救助を補佐する者１名以上が乗船すること\"","v":"本船（船名を入力してください、船舶番号XXX-XXXXX）は、水域6（選択してください（水温20℃以上となる水域を除く））を航行する際、別表（救助船_水温①）に掲げる船舶（以下「救助船」という。）を配備する。\n\n遵守事項\n・本船の航路は、救助船の航行区域内とすること\n・救助船は、本船が航行する間、本船から救助の要請があった場合に直ちに救助に向かう位置で待機していること\n・救助船には、救助時に向かう際は旅客を搭載しないこと\n・救助船には、船長のほか救助を補佐する者１名以上が乗船すること"},{"$f":"B1&\"は、水域\"&B2&\"（\"&B3&\"）のうち水温15℃未満となる水域を航行する際、\"&B5","v":"本船（船名を入力してください、船舶番号XXX-XXXXX）は、水域6（選択してください）のうち水温15℃未満となる水域を航行する際、事業（海上運送法における人の運送を行う事業や遊漁船業）の用に供しない。"},{"$f":"B1&\"は、水域\"&B2&\"（\"&B3&\"（水温15℃以上であって母港（\"&B4&\"）から５海里以内の水域と水温20℃未満となる水域を除く））を航行する際、\"&B5","v":"本船（船名を入力してください、船舶番号XXX-XXXXX）は、水域6（選択してください（水温15℃以上であって母港（営業船の母港を入力してください（選択してください選択してください））から５海里以内の水域と水温20℃未満となる水域を除く））を航行する際、事業（海上運送法における人の運送を行う事業や遊漁船業）の用に供しない。"},{"$f":"B1&\"は、水域\"&B2&\"（\"&B3&\"）を航行する際、下記１．又は２．に記載のいずれの安全対策を講じない場合、\"&B5&\"\n\n\"&\"１．別表（伴走船_水温①）に掲げる船舶（以下「伴走船」という。）と共に航行する。\n\"&\"遵守事項\n・３隻以内の伴走船と共に航行すること\n・伴走船の搭載人員は、別表の搭載可能人員を超えることなく、本船の搭載人員分を搭載（救助）できるようにすること\n・伴走船が、出航から帰港まで本船を常に視認でき、かつ、万が一乗客が水中待機した場合であっても早急に救助できる位置を航行すること\n・伴走船には、船長のほか救助を補佐する者１名以上が乗船すること\n　（なお、船員以外の者を補佐人として指定する場合、船長はその者に対し、発航前にその旨を説明し理解を得ること）\"&\"\n\n\"&\"２．別表（救助船_水温①）に掲げる船舶（以下「救助船」という。）を配備する。\n\"&\"遵守事項\n・本船の航路は、救助船の航行区域内とすること\n・救助船は、本船が航行する間、本船から救助の要請があった場合に直ちに救助に向かう位置で待機していること\n・救助船には、救助時に向かう際は旅客を搭載しないこと\n・救助船には、船長のほか救助を補佐する者１名以上が乗船すること\"","v":"本船（船名を入力してください、船舶番号XXX-XXXXX）は、水域6（選択してください）を航行する際、下記１．又は２．に記載のいずれの安全対策を講じない場合、事業（海上運送法における人の運送を行う事業や遊漁船業）の用に供しない。\n\n１．別表（伴走船_水温①）に掲げる船舶（以下「伴走船」という。）と共に航行する。\n遵守事項\n・３隻以内の伴走船と共に航行すること\n・伴走船の搭載人員は、別表の搭載可能人員を超えることなく、本船の搭載人員分を搭載（救助）できるようにすること\n・伴走船が、出航から帰港まで本船を常に視認でき、かつ、万が一乗客が水中待機した場合であっても早急に救助できる位置を航行すること\n・伴走船には、船長のほか救助を補佐する者１名以上が乗船すること\n　（なお、船員以外の者を補佐人として指定する場合、船長はその者に対し、発航前にその旨を説明し理解を得ること）\n\n２．別表（救助船_水温①）に掲げる船舶（以下「救助船」という。）を配備する。\n遵守事項\n・本船の航路は、救助船の航行区域内とすること\n・救助船は、本船が航行する間、本船から救助の要請があった場合に直ちに救助に向かう位置で待機していること\n・救助船には、救助時に向かう際は旅客を搭載しないこと\n・救助船には、船長のほか救助を補佐する者１名以上が乗船すること"},{"$f":"B1&\"は、水域\"&B2&\"（\"&B3&\"（水温20℃以上となる水域を除く））を航行する際、下記１．又は２．に記載のいずれかの安全対策を講じる。\"&\"\n\n\"&\"１．別表（伴走船_水温①）に掲げる船舶（以下「伴走船」という。）と共に航行する。\n\"&\"遵守事項\n・３隻以内の伴走船と共に航行すること\n・伴走船の搭載人員は、別表の搭載可能人員を超えることなく、本船の搭載人員分を搭載（救助）できるようにすること\n・伴走船が、出航から帰港まで本船を常に視認でき、かつ、万が一乗客が水中待機した場合であっても早急に救助できる位置を航行すること\n・伴走船には、船長のほか救助を補佐する者１名以上が乗船すること\n　（なお、船員以外の者を補佐人として指定する場合、船長はその者に対し、発航前にその旨を説明し理解を得ること）\"&\"\n\n\"&\"２．別表（救助船_水温①）に掲げる船舶（以下「救助船」という。）を配備する。\n\"&\"遵守事項\n・本船の航路は、救助船の航行区域内とすること\n・救助船は、本船が航行する間、本船から救助の要請があった場合に直ちに救助に向かう位置で待機していること\n・救助船には、救助時に向かう際は旅客を搭載しないこと\n・救助船には、船長のほか救助を補佐する者１名以上が乗船すること\"","v":"本船（船名を入力してください、船舶番号XXX-XXXXX）は、水域6（選択してください（水温20℃以上となる水域を除く））を航行する際、下記１．又は２．に記載のいずれかの安全対策を講じる。\n\n１．別表（伴走船_水温①）に掲げる船舶（以下「伴走船」という。）と共に航行する。\n遵守事項\n・３隻以内の伴走船と共に航行すること\n・伴走船の搭載人員は、別表の搭載可能人員を超えることなく、本船の搭載人員分を搭載（救助）できるようにすること\n・伴走船が、出航から帰港まで本船を常に視認でき、かつ、万が一乗客が水中待機した場合であっても早急に救助できる位置を航行すること\n・伴走船には、船長のほか救助を補佐する者１名以上が乗船すること\n　（なお、船員以外の者を補佐人として指定する場合、船長はその者に対し、発航前にその旨を説明し理解を得ること）\n\n２．別表（救助船_水温①）に掲げる船舶（以下「救助船」という。）を配備する。\n遵守事項\n・本船の航路は、救助船の航行区域内とすること\n・救助船は、本船が航行する間、本船から救助の要請があった場合に直ちに救助に向かう位置で待機していること\n・救助船には、救助時に向かう際は旅客を搭載しないこと\n・救助船には、船長のほか救助を補佐する者１名以上が乗船すること"},{"$f":"B1&\"は、水域\"&B2&\"（\"&B3&\"）を航行する際、下記１．に記載の安全対策を講じない場合、\"&B5&\"\n\n\"&\"１．別表（救助船_水温①）に掲げる船舶（以下「救助船」という。）を配備する。\n\"&\"遵守事項\n・本船の航路は、救助船の航行区域内とすること\n・救助船は、本船が航行する間、本船から救助の要請があった場合に直ちに救助に向かう位置で待機していること\n・救助船には、救助時に向かう際は旅客を搭載しないこと\n・救助船には、船長のほか救助を補佐する者１名以上が乗船すること\"","v":"本船（船名を入力してください、船舶番号XXX-XXXXX）は、水域6（選択してください）を航行する際、下記１．に記載の安全対策を講じない場合、事業（海上運送法における人の運送を行う事業や遊漁船業）の用に供しない。\n\n１．別表（救助船_水温①）に掲げる船舶（以下「救助船」という。）を配備する。\n遵守事項\n・本船の航路は、救助船の航行区域内とすること\n・救助船は、本船が航行する間、本船から救助の要請があった場合に直ちに救助に向かう位置で待機していること\n・救助船には、救助時に向かう際は旅客を搭載しないこと\n・救助船には、船長のほか救助を補佐する者１名以上が乗船すること"},{"$f":"B1&\"は、水域\"&B2&\"（\"&B3&\"）を航行する際、下記１．に記載の安全対策を講じない場合、\"&B5&\"\n\n\"&\"１．別表（伴走船_水温①）に掲げる船舶（以下「伴走船」という。）と共に航行する。\n\"&\"遵守事項\n・３隻以内の伴走船と共に航行すること\n・伴走船の搭載人員は、別表の搭載可能人員を超えることなく、本船の搭載人員分を搭載（救助）できるようにすること\n・伴走船が、出航から帰港まで本船を常に視認でき、かつ、万が一乗客が水中待機した場合であっても早急に救助できる位置を航行すること\n・伴走船には、船長のほか救助を補佐する者１名以上が乗船すること\n　（なお、船員以外の者を補佐人として指定する場合、船長はその者に対し、発航前にその旨を説明し理解を得ること）\"","v":"本船（船名を入力してください、船舶番号XXX-XXXXX）は、水域6（選択してください）を航行する際、下記１．に記載の安全対策を講じない場合、事業（海上運送法における人の運送を行う事業や遊漁船業）の用に供しない。\n\n１．別表（伴走船_水温①）に掲げる船舶（以下「伴走船」という。）と共に航行する。\n遵守事項\n・３隻以内の伴走船と共に航行すること\n・伴走船の搭載人員は、別表の搭載可能人員を超えることなく、本船の搭載人員分を搭載（救助）できるようにすること\n・伴走船が、出航から帰港まで本船を常に視認でき、かつ、万が一乗客が水中待機した場合であっても早急に救助できる位置を航行すること\n・伴走船には、船長のほか救助を補佐する者１名以上が乗船すること\n　（なお、船員以外の者を補佐人として指定する場合、船長はその者に対し、発航前にその旨を説明し理解を得ること）"},{"$f":"B1&\"は、水域\"&B2&\"（\"&B3&\"（水温15℃以上であって母港（\"&B4&\"）から５海里以内の水域を除く））を航行する際、下記１．又は２．に記載のいずれの安全対策を講じない場合、\"&B5&\"\n\n\"&\"１．別表（伴走船_水温①）に掲げる船舶（以下「伴走船」という。）と共に航行する。\n\"&\"遵守事項\n・３隻以内の伴走船と共に航行すること\n・伴走船の搭載人員は、別表の搭載可能人員を超えることなく、本船の搭載人員分を搭載（救助）できるようにすること\n・伴走船が、出航から帰港まで本船を常に視認でき、かつ、万が一乗客が水中待機した場合であっても早急に救助できる位置を航行すること\n・伴走船には、船長のほか救助を補佐する者１名以上が乗船すること\n　（なお、船員以外の者を補佐人として指定する場合、船長はその者に対し、発航前にその旨を説明し理解を得ること）\"&\"\n\n\"&\"２．別表（救助船_水温①）に掲げる船舶（以下「救助船」という。）を配備する。\n\"&\"遵守事項\n・本船の航路は、救助船の航行区域内とすること\n・救助船は、本船が航行する間、本船から救助の要請があった場合に直ちに救助に向かう位置で待機していること\n・救助船には、救助時に向かう際は旅客を搭載しないこと\n・救助船には、船長のほか救助を補佐する者１名以上が乗船すること\"","v":"本船（船名を入力してください、船舶番号XXX-XXXXX）は、水域6（選択してください（水温15℃以上であって母港（営業船の母港を入力してください（選択してください選択してください））から５海里以内の水域を除く））を航行する際、下記１．又は２．に記載のいずれの安全対策を講じない場合、事業（海上運送法における人の運送を行う事業や遊漁船業）の用に供しない。\n\n１．別表（伴走船_水温①）に掲げる船舶（以下「伴走船」という。）と共に航行する。\n遵守事項\n・３隻以内の伴走船と共に航行すること\n・伴走船の搭載人員は、別表の搭載可能人員を超えることなく、本船の搭載人員分を搭載（救助）できるようにすること\n・伴走船が、出航から帰港まで本船を常に視認でき、かつ、万が一乗客が水中待機した場合であっても早急に救助できる位置を航行すること\n・伴走船には、船長のほか救助を補佐する者１名以上が乗船すること\n　（なお、船員以外の者を補佐人として指定する場合、船長はその者に対し、発航前にその旨を説明し理解を得ること）\n\n２．別表（救助船_水温①）に掲げる船舶（以下「救助船」という。）を配備する。\n遵守事項\n・本船の航路は、救助船の航行区域内とすること\n・救助船は、本船が航行する間、本船から救助の要請があった場合に直ちに救助に向かう位置で待機していること\n・救助船には、救助時に向かう際は旅客を搭載しないこと\n・救助船には、船長のほか救助を補佐する者１名以上が乗船すること"},{"$f":"B1&\"は、水域\"&B2&\"（\"&B3&\"（水温15℃以上であって母港（\"&B4&\"）から５海里以内の水域と水温20℃以上となる水域を除く））を航行する際、下記１．又は２．に記載のいずれかの安全対策を講じる。\"&\"\n\n\"&\"１．別表（伴走船_水温①）に掲げる船舶（以下「伴走船」という。）と共に航行する。\n\"&\"遵守事項\n・３隻以内の伴走船と共に航行すること\n・伴走船の搭載人員は、別表の搭載可能人員を超えることなく、本船の搭載人員分を搭載（救助）できるようにすること\n・伴走船が、出航から帰港まで本船を常に視認でき、かつ、万が一乗客が水中待機した場合であっても早急に救助できる位置を航行すること\n・伴走船には、船長のほか救助を補佐する者１名以上が乗船すること\n　（なお、船員以外の者を補佐人として指定する場合、船長はその者に対し、発航前にその旨を説明し理解を得ること）\"&\"\n\n\"&\"２．別表（救助船_水温①）に掲げる船舶（以下「救助船」という。）を配備する。\n\"&\"遵守事項\n・本船の航路は、救助船の航行区域内とすること\n・救助船は、本船が航行する間、本船から救助の要請があった場合に直ちに救助に向かう位置で待機していること\n・救助船には、救助時に向かう際は旅客を搭載しないこと\n・救助船には、船長のほか救助を補佐する者１名以上が乗船すること\"","v":"本船（船名を入力してください、船舶番号XXX-XXXXX）は、水域6（選択してください（水温15℃以上であって母港（営業船の母港を入力してください（選択してください選択してください））から５海里以内の水域と水温20℃以上となる水域を除く））を航行する際、下記１．又は２．に記載のいずれかの安全対策を講じる。\n\n１．別表（伴走船_水温①）に掲げる船舶（以下「伴走船」という。）と共に航行する。\n遵守事項\n・３隻以内の伴走船と共に航行すること\n・伴走船の搭載人員は、別表の搭載可能人員を超えることなく、本船の搭載人員分を搭載（救助）できるようにすること\n・伴走船が、出航から帰港まで本船を常に視認でき、かつ、万が一乗客が水中待機した場合であっても早急に救助できる位置を航行すること\n・伴走船には、船長のほか救助を補佐する者１名以上が乗船すること\n　（なお、船員以外の者を補佐人として指定する場合、船長はその者に対し、発航前にその旨を説明し理解を得ること）\n\n２．別表（救助船_水温①）に掲げる船舶（以下「救助船」という。）を配備する。\n遵守事項\n・本船の航路は、救助船の航行区域内とすること\n・救助船は、本船が航行する間、本船から救助の要請があった場合に直ちに救助に向かう位置で待機していること\n・救助船には、救助時に向かう際は旅客を搭載しないこと\n・救助船には、船長のほか救助を補佐する者１名以上が乗船すること"},{"$f":"B1&\"は、水域\"&B2&\"（\"&B3&\"（水温15℃以上であって母港（\"&B4&\"）から５海里以内の水域））を航行する際、下記１．に記載の安全対策を講じない場合、\"&B5&\"\n\n\"&\"１．別表（救助船_水温①）に掲げる船舶（以下「救助船」という。）を配備する。\n\"&\"遵守事項\n・本船の航路は、救助船の航行区域内とすること\n・救助船は、本船が航行する間、本船から救助の要請があった場合に直ちに救助に向かう位置で待機していること\n・救助船には、救助時に向かう際は旅客を搭載しないこと\n・救助船には、船長のほか救助を補佐する者１名以上が乗船すること\"","v":"本船（船名を入力してください、船舶番号XXX-XXXXX）は、水域6（選択してください（水温15℃以上であって母港（営業船の母港を入力してください（選択してください選択してください））から５海里以内の水域））を航行する際、下記１．に記載の安全対策を講じない場合、事業（海上運送法における人の運送を行う事業や遊漁船業）の用に供しない。\n\n１．別表（救助船_水温①）に掲げる船舶（以下「救助船」という。）を配備する。\n遵守事項\n・本船の航路は、救助船の航行区域内とすること\n・救助船は、本船が航行する間、本船から救助の要請があった場合に直ちに救助に向かう位置で待機していること\n・救助船には、救助時に向かう際は旅客を搭載しないこと\n・救助船には、船長のほか救助を補佐する者１名以上が乗船すること"},{"$f":"B1&\"は、水域\"&B2&\"（\"&B3&\"（水温15℃以上であって母港（\"&B4&\"）から５海里以内の水域））を航行する際、\"&B5","v":"本船（船名を入力してください、船舶番号XXX-XXXXX）は、水域6（選択してください（水温15℃以上であって母港（営業船の母港を入力してください（選択してください選択してください））から５海里以内の水域））を航行する際、事業（海上運送法における人の運送を行う事業や遊漁船業）の用に供しない。"},{"$f":"B1&\"は、水域\"&B2&\"（\"&B3&\"（水温15℃以上であって母港（\"&B4&\"）から５海里以内の水域と水温20℃以上となる水域を除く））を航行する際、別表（救助船_水温①）に掲げる船舶（以下「救助船」という。）を配備する。\n\"&\"\n遵守事項\n・本船の航路は、救助船の航行区域内とすること\n・救助船は、本船が航行する間、本船から救助の要請があった場合に直ちに救助に向かう位置で待機していること\n・救助船には、救助時に向かう際は旅客を搭載しないこと\n・救助船には、船長のほか救助を補佐する者１名以上が乗船すること\"","v":"本船（船名を入力してください、船舶番号XXX-XXXXX）は、水域6（選択してください（水温15℃以上であって母港（営業船の母港を入力してください（選択してください選択してください））から５海里以内の水域と水温20℃以上となる水域を除く））を航行する際、別表（救助船_水温①）に掲げる船舶（以下「救助船」という。）を配備する。\n\n遵守事項\n・本船の航路は、救助船の航行区域内とすること\n・救助船は、本船が航行する間、本船から救助の要請があった場合に直ちに救助に向かう位置で待機していること\n・救助船には、救助時に向かう際は旅客を搭載しないこと\n・救助船には、船長のほか救助を補佐する者１名以上が乗船すること"},{"$f":"B1&\"は、水域\"&B2&\"（\"&B3&\"（水温15℃以上であって母港（\"&B4&\"）から５海里以内の水域を除く））を航行する際、下記１．に記載の安全対策を講じない場合、\"&B5&\"\n\n\"&\"１．別表（伴走船_水温①）に掲げる船舶（以下「伴走船」という。）と共に航行する。\n\"&\"遵守事項\n・３隻以内の伴走船と共に航行すること\n・伴走船の搭載人員は、別表の搭載可能人員を超えることなく、本船の搭載人員分を搭載（救助）できるようにすること\n・伴走船が、出航から帰港まで本船を常に視認でき、かつ、万が一乗客が水中待機した場合であっても早急に救助できる位置を航行すること\n・伴走船には、船長のほか救助を補佐する者１名以上が乗船すること\n　（なお、船員以外の者を補佐人として指定する場合、船長はその者に対し、発航前にその旨を説明し理解を得ること）\"","v":"本船（船名を入力してください、船舶番号XXX-XXXXX）は、水域6（選択してください（水温15℃以上であって母港（営業船の母港を入力してください（選択してください選択してください））から５海里以内の水域を除く））を航行する際、下記１．に記載の安全対策を講じない場合、事業（海上運送法における人の運送を行う事業や遊漁船業）の用に供しない。\n\n１．別表（伴走船_水温①）に掲げる船舶（以下「伴走船」という。）と共に航行する。\n遵守事項\n・３隻以内の伴走船と共に航行すること\n・伴走船の搭載人員は、別表の搭載可能人員を超えることなく、本船の搭載人員分を搭載（救助）できるようにすること\n・伴走船が、出航から帰港まで本船を常に視認でき、かつ、万が一乗客が水中待機した場合であっても早急に救助できる位置を航行すること\n・伴走船には、船長のほか救助を補佐する者１名以上が乗船すること\n　（なお、船員以外の者を補佐人として指定する場合、船長はその者に対し、発航前にその旨を説明し理解を得ること）"},{"$f":"B1&\"は、水域\"&B2&\"（\"&B3&\"（水温15℃以上であって母港（\"&B4&\"）から５海里以内の水域と水温20℃以上となる水域を除く））を航行する際、別表（伴走船_水温①）に掲げる船舶（以下「伴走船」という。）と共に航行する。\n\"&\"\n遵守事項\n・３隻以内の伴走船と共に航行すること\n・伴走船の搭載人員は、別表の搭載可能人員を超えることなく、本船の搭載人員分を搭載（救助）できるようにすること\n・伴走船が、出航から帰港まで本船を常に視認でき、かつ、万が一乗客が水中待機した場合であっても早急に救助できる位置を航行すること\n・伴走船には、船長のほか救助を補佐する者１名以上が乗船すること\n　（なお、船員以外の者を補佐人として指定する場合、船長はその者に対し、発航前にその旨を説明し理解を得ること）\"","v":"本船（船名を入力してください、船舶番号XXX-XXXXX）は、水域6（選択してください（水温15℃以上であって母港（営業船の母港を入力してください（選択してください選択してください））から５海里以内の水域と水温20℃以上となる水域を除く））を航行する際、別表（伴走船_水温①）に掲げる船舶（以下「伴走船」という。）と共に航行する。\n\n遵守事項\n・３隻以内の伴走船と共に航行すること\n・伴走船の搭載人員は、別表の搭載可能人員を超えることなく、本船の搭載人員分を搭載（救助）できるようにすること\n・伴走船が、出航から帰港まで本船を常に視認でき、かつ、万が一乗客が水中待機した場合であっても早急に救助できる位置を航行すること\n・伴走船には、船長のほか救助を補佐する者１名以上が乗船すること\n　（なお、船員以外の者を補佐人として指定する場合、船長はその者に対し、発航前にその旨を説明し理解を得ること）"},{"$f":"B1&\"は、水域\"&B2&\"（\"&B3&\"（水温15℃以上となる水域を除く））を航行する際、下記１．又は２．に記載のいずれの安全対策を講じない場合、\"&B5&\"\n\n\"&\"１．別表（伴走船_水温①）に掲げる船舶（以下「伴走船」という。）と共に航行する。\n\"&\"遵守事項\n・３隻以内の伴走船と共に航行すること\n・伴走船の搭載人員は、別表の搭載可能人員を超えることなく、本船の搭載人員分を搭載（救助）できるようにすること\n・伴走船が、出航から帰港まで本船を常に視認でき、かつ、万が一乗客が水中待機した場合であっても早急に救助できる位置を航行すること\n・伴走船には、船長のほか救助を補佐する者１名以上が乗船すること\n　（なお、船員以外の者を補佐人として指定する場合、船長はその者に対し、発航前にその旨を説明し理解を得ること）\"&\"\n\n\"&\"２．別表（救助船_水温①）に掲げる船舶（以下「救助船」という。）を配備する。\n\"&\"遵守事項\n・本船の航路は、救助船の航行区域内とすること\n・救助船は、本船が航行する間、本船から救助の要請があった場合に直ちに救助に向かう位置で待機していること\n・救助船には、救助時に向かう際は旅客を搭載しないこと\n・救助船には、船長のほか救助を補佐する者１名以上が乗船すること\"","v":"本船（船名を入力してください、船舶番号XXX-XXXXX）は、水域6（選択してください（水温15℃以上となる水域を除く））を航行する際、下記１．又は２．に記載のいずれの安全対策を講じない場合、事業（海上運送法における人の運送を行う事業や遊漁船業）の用に供しない。\n\n１．別表（伴走船_水温①）に掲げる船舶（以下「伴走船」という。）と共に航行する。\n遵守事項\n・３隻以内の伴走船と共に航行すること\n・伴走船の搭載人員は、別表の搭載可能人員を超えることなく、本船の搭載人員分を搭載（救助）できるようにすること\n・伴走船が、出航から帰港まで本船を常に視認でき、かつ、万が一乗客が水中待機した場合であっても早急に救助できる位置を航行すること\n・伴走船には、船長のほか救助を補佐する者１名以上が乗船すること\n　（なお、船員以外の者を補佐人として指定する場合、船長はその者に対し、発航前にその旨を説明し理解を得ること）\n\n２．別表（救助船_水温①）に掲げる船舶（以下「救助船」という。）を配備する。\n遵守事項\n・本船の航路は、救助船の航行区域内とすること\n・救助船は、本船が航行する間、本船から救助の要請があった場合に直ちに救助に向かう位置で待機していること\n・救助船には、救助時に向かう際は旅客を搭載しないこと\n・救助船には、船長のほか救助を補佐する者１名以上が乗船すること"},{"$f":"B1&\"は、水域\"&B2&\"（\"&B3&\"（水温15℃以上となる水域を除く））を航行する際、下記１．又は２．に記載のいずれかの安全対策を講じる。\"&\"\n\n\"&\"１．別表（伴走船_水温①）に掲げる船舶（以下「伴走船」という。）と共に航行する。\n\"&\"遵守事項\n・３隻以内の伴走船と共に航行すること\n・伴走船の搭載人員は、別表の搭載可能人員を超えることなく、本船の搭載人員分を搭載（救助）できるようにすること\n・伴走船が、出航から帰港まで本船を常に視認でき、かつ、万が一乗客が水中待機した場合であっても早急に救助できる位置を航行すること\n・伴走船には、船長のほか救助を補佐する者１名以上が乗船すること\n　（なお、船員以外の者を補佐人として指定する場合、船長はその者に対し、発航前にその旨を説明し理解を得ること）\"&\"\n\n\"&\"２．別表（救助船_水温①）に掲げる船舶（以下「救助船」という。）を配備する。\n\"&\"遵守事項\n・本船の航路は、救助船の航行区域内とすること\n・救助船は、本船が航行する間、本船から救助の要請があった場合に直ちに救助に向かう位置で待機していること\n・救助船には、救助時に向かう際は旅客を搭載しないこと\n・救助船には、船長のほか救助を補佐する者１名以上が乗船すること\"","v":"本船（船名を入力してください、船舶番号XXX-XXXXX）は、水域6（選択してください（水温15℃以上となる水域を除く））を航行する際、下記１．又は２．に記載のいずれかの安全対策を講じる。\n\n１．別表（伴走船_水温①）に掲げる船舶（以下「伴走船」という。）と共に航行する。\n遵守事項\n・３隻以内の伴走船と共に航行すること\n・伴走船の搭載人員は、別表の搭載可能人員を超えることなく、本船の搭載人員分を搭載（救助）できるようにすること\n・伴走船が、出航から帰港まで本船を常に視認でき、かつ、万が一乗客が水中待機した場合であっても早急に救助できる位置を航行すること\n・伴走船には、船長のほか救助を補佐する者１名以上が乗船すること\n　（なお、船員以外の者を補佐人として指定する場合、船長はその者に対し、発航前にその旨を説明し理解を得ること）\n\n２．別表（救助船_水温①）に掲げる船舶（以下「救助船」という。）を配備する。\n遵守事項\n・本船の航路は、救助船の航行区域内とすること\n・救助船は、本船が航行する間、本船から救助の要請があった場合に直ちに救助に向かう位置で待機していること\n・救助船には、救助時に向かう際は旅客を搭載しないこと\n・救助船には、船長のほか救助を補佐する者１名以上が乗船すること"},{"$f":"B1&\"は、水域\"&B2&\"（\"&B3&\"（水温15℃以上となる水域を除く））を航行する際、下記１．に記載の安全対策を講じない場合、\"&B5&\"\n\n\"&\"１．別表（救助船_水温①）に掲げる船舶（以下「救助船」という。）を配備する。\n\"&\"遵守事項\n・本船の航路は、救助船の航行区域内とすること\n・救助船は、本船が航行する間、本船から救助の要請があった場合に直ちに救助に向かう位置で待機していること\n・救助船には、救助時に向かう際は旅客を搭載しないこと\n・救助船には、船長のほか救助を補佐する者１名以上が乗船すること\"","v":"本船（船名を入力してください、船舶番号XXX-XXXXX）は、水域6（選択してください（水温15℃以上となる水域を除く））を航行する際、下記１．に記載の安全対策を講じない場合、事業（海上運送法における人の運送を行う事業や遊漁船業）の用に供しない。\n\n１．別表（救助船_水温①）に掲げる船舶（以下「救助船」という。）を配備する。\n遵守事項\n・本船の航路は、救助船の航行区域内とすること\n・救助船は、本船が航行する間、本船から救助の要請があった場合に直ちに救助に向かう位置で待機していること\n・救助船には、救助時に向かう際は旅客を搭載しないこと\n・救助船には、船長のほか救助を補佐する者１名以上が乗船すること"},{"$f":"B1&\"は、水域\"&B2&\"（\"&B3&\"）のうち水温15℃未満となる水域を航行する際、\"&B5","v":"本船（船名を入力してください、船舶番号XXX-XXXXX）は、水域6（選択してください）のうち水温15℃未満となる水域を航行する際、事業（海上運送法における人の運送を行う事業や遊漁船業）の用に供しない。"},{"$f":"B1&\"は、水域\"&B2&\"（\"&B3&\"（水温15℃以上となる水域を除く））を航行する際、別表（救助船_水温①）に掲げる船舶（以下「救助船」という。）を配備する。\n\"&\"\n遵守事項\n・本船の航路は、救助船の航行区域内とすること\n・救助船は、本船が航行する間、本船から救助の要請があった場合に直ちに救助に向かう位置で待機していること\n・救助船には、救助時に向かう際は旅客を搭載しないこと\n・救助船には、船長のほか救助を補佐する者１名以上が乗船すること\"","v":"本船（船名を入力してください、船舶番号XXX-XXXXX）は、水域6（選択してください（水温15℃以上となる水域を除く））を航行する際、別表（救助船_水温①）に掲げる船舶（以下「救助船」という。）を配備する。\n\n遵守事項\n・本船の航路は、救助船の航行区域内とすること\n・救助船は、本船が航行する間、本船から救助の要請があった場合に直ちに救助に向かう位置で待機していること\n・救助船には、救助時に向かう際は旅客を搭載しないこと\n・救助船には、船長のほか救助を補佐する者１名以上が乗船すること"},{"$f":"B1&\"は、水域\"&B2&\"（\"&B3&\"（水温15℃以上となる水域を除く））を航行する際、下記１．に記載の安全対策を講じない場合、\"&B5&\"\n\n\"&\"１．別表（伴走船_水温①）に掲げる船舶（以下「伴走船」という。）と共に航行する。\n\"&\"遵守事項\n・３隻以内の伴走船と共に航行すること\n・伴走船の搭載人員は、別表の搭載可能人員を超えることなく、本船の搭載人員分を搭載（救助）できるようにすること\n・伴走船が、出航から帰港まで本船を常に視認でき、かつ、万が一乗客が水中待機した場合であっても早急に救助できる位置を航行すること\n・伴走船には、船長のほか救助を補佐する者１名以上が乗船すること\n　（なお、船員以外の者を補佐人として指定する場合、船長はその者に対し、発航前にその旨を説明し理解を得ること）\"","v":"本船（船名を入力してください、船舶番号XXX-XXXXX）は、水域6（選択してください（水温15℃以上となる水域を除く））を航行する際、下記１．に記載の安全対策を講じない場合、事業（海上運送法における人の運送を行う事業や遊漁船業）の用に供しない。\n\n１．別表（伴走船_水温①）に掲げる船舶（以下「伴走船」という。）と共に航行する。\n遵守事項\n・３隻以内の伴走船と共に航行すること\n・伴走船の搭載人員は、別表の搭載可能人員を超えることなく、本船の搭載人員分を搭載（救助）できるようにすること\n・伴走船が、出航から帰港まで本船を常に視認でき、かつ、万が一乗客が水中待機した場合であっても早急に救助できる位置を航行すること\n・伴走船には、船長のほか救助を補佐する者１名以上が乗船すること\n　（なお、船員以外の者を補佐人として指定する場合、船長はその者に対し、発航前にその旨を説明し理解を得ること）"},{"$f":"B1&\"は、水域\"&B2&\"（\"&B3&\"（水温15℃以上となる水域を除く））を航行する際、別表（伴走船_水温①）に掲げる船舶（以下「伴走船」という。）と共に航行する。\n\"&\"\n遵守事項\n・３隻以内の伴走船と共に航行すること\n・伴走船の搭載人員は、別表の搭載可能人員を超えることなく、本船の搭載人員分を搭載（救助）できるようにすること\n・伴走船が、出航から帰港まで本船を常に視認でき、かつ、万が一乗客が水中待機した場合であっても早急に救助できる位置を航行すること\n・伴走船には、船長のほか救助を補佐する者１名以上が乗船すること\n　（なお、船員以外の者を補佐人として指定する場合、船長はその者に対し、発航前にその旨を説明し理解を得ること）\"","v":"本船（船名を入力してください、船舶番号XXX-XXXXX）は、水域6（選択してください（水温15℃以上となる水域を除く））を航行する際、別表（伴走船_水温①）に掲げる船舶（以下「伴走船」という。）と共に航行する。\n\n遵守事項\n・３隻以内の伴走船と共に航行すること\n・伴走船の搭載人員は、別表の搭載可能人員を超えることなく、本船の搭載人員分を搭載（救助）できるようにすること\n・伴走船が、出航から帰港まで本船を常に視認でき、かつ、万が一乗客が水中待機した場合であっても早急に救助できる位置を航行すること\n・伴走船には、船長のほか救助を補佐する者１名以上が乗船すること\n　（なお、船員以外の者を補佐人として指定する場合、船長はその者に対し、発航前にその旨を説明し理解を得ること）"}]
["水温②（航行する水域の中に水温10℃以上15℃未満となる水域が含まれる時期（水温①の時期を除く。））",null,null,null,{"$f":"B1&\"は、水域\"&B2&\"（\"&B3&\"）を航行する際、\"&C5","v":"本船（船名を入力してください、船舶番号XXX-XXXXX）は、水域6（選択してください）を航行する際、事業（海上運送法における人の運送を行う事業や遊漁船業）の用に供しない。"},{"$f":"B1&\"は、水域\"&B2&\"（\"&B3&\"（水温20℃以上となる水域を除く））を航行する際、別表（伴走船_水温②）に掲げる船舶（以下「伴走船」という。）と共に航行する。\"&\"\n\n\"&\"遵守事項\n・３隻以内の伴走船と共に航行すること\n・伴走船の搭載人員は、別表の搭載可能人員を超えることなく、本船の搭載人員分を搭載（救助）できるようにすること\n・伴走船が、出航から帰港まで本船を常に視認でき、かつ、万が一乗客が水中待機した場合であっても早急に救助できる位置を航行すること\n・伴走船には、船長のほか救助を補佐する者１名以上が乗船すること\n　（なお、船員以外の者を補佐人として指定する場合、船長はその者に対し、発航前にその旨を説明し理解を得ること）\"","v":"本船（船名を入力してください、船舶番号XXX-XXXXX）は、水域6（選択してください（水温20℃以上となる水域を除く））を航行する際、別表（伴走船_水温②）に掲げる船舶（以下「伴走船」という。）と共に航行する。\n\n遵守事項\n・３隻以内の伴走船と共に航行すること\n・伴走船の搭載人員は、別表の搭載可能人員を超えることなく、本船の搭載人員分を搭載（救助）できるようにすること\n・伴走船が、出航から帰港まで本船を常に視認でき、かつ、万が一乗客が水中待機した場合であっても早急に救助できる位置を航行すること\n・伴走船には、船長のほか救助を補佐する者１名以上が乗船すること\n　（なお、船員以外の者を補佐人として指定する場合、船長はその者に対し、発航前にその旨を説明し理解を得ること）"},{"$f":"B1&\"は、水域\"&B2&\"（\"&B3&\"（水温20℃以上となる水域を除く））を航行する際、別表（救助船_水温②）に掲げる船舶（以下「救助船」という。）を配備する。\"&\"\n\n\"&\"遵守事項\n・本船の航路は、救助船の航行区域内とすること\n・救助船は、本船が航行する間、本船から救助の要請があった場合に直ちに救助に向かう位置で待機していること\n・救助船には、救助時に向かう際は旅客を搭載しないこと\n・救助船には、船長のほか救助を補佐する者１名以上が乗船すること\"","v":"本船（船名を入力してください、船舶番号XXX-XXXXX）は、水域6（選択してください（水温20℃以上となる水域を除く））を航行する際、別表（救助船_水温②）に掲げる船舶（以下「救助船」という。）を配備する。\n\n遵守事項\n・本船の航路は、救助船の航行区域内とすること\n・救助船は、本船が航行する間、本船から救助の要請があった場合に直ちに救助に向かう位置で待機していること\n・救助船には、救助時に向かう際は旅客を搭載しないこと\n・救助船には、船長のほか救助を補佐する者１名以上が乗船すること"},{"$f":"B1&\"は、水域\"&B2&\"（\"&B3&\"）のうち水温15℃未満となる水域を航行する際、\"&C5","v":"本船（船名を入力してください、船舶番号XXX-XXXXX）は、水域6（選択してください）のうち水温15℃未満となる水域を航行する際、事業（海上運送法における人の運送を行う事業や遊漁船業）の用に供しない。"},{"$f":"B1&\"は、水域\"&B2&\"（\"&B3&\"（水温15℃以上であって母港（\"&C4&\"）から５海里以内の水域と水温20℃未満となる水域を除く））を航行する際、\"&C5","v":"本船（船名を入力してください、船舶番号XXX-XXXXX）は、水域6（選択してください（水温15℃以上であって母港（営業船の母港を入力してください（選択してください選択してください））から５海里以内の水域と水温20℃未満となる水域を除く））を航行する際、事業（海上運送法における人の運送を行う事業や遊漁船業）の用に供しない。"},{"$f":"B1&\"は、水域\"&B2&\"（\"&B3&\"）を航行する際、下記１．又は２．に記載のいずれの安全対策を講じない場合、\"&C5&\"\n\n\"&\"１．別表（伴走船_水温②）に掲げる船舶（以下「伴走船」という。）と共に航行する。\n\"&\"遵守事項\n・３隻以内の伴走船と共に航行すること\n・伴走船の搭載人員は、別表の搭載可能人員を超えることなく、本船の搭載人員分を搭載（救助）できるようにすること\n・伴走船が、出航から帰港まで本船を常に視認でき、かつ、万が一乗客が水中待機した場合であっても早急に救助できる位置を航行すること\n・伴走船には、船長のほか救助を補佐する者１名以上が乗船すること\n　（なお、船員以外の者を補佐人として指定する場合、船長はその者に対し、発航前にその旨を説明し理解を得ること）\"&\"\n\n\"&\"２．別表（救助船_水温②）に掲げる船舶（以下「救助船」という。）を配備する。\n\"&\"遵守事項\n・本船の航路は、救助船の航行区域内とすること\n・救助船は、本船が航行する間、本船から救助の要請があった場合に直ちに救助に向かう位置で待機していること\n・救助船には、救助時に向かう際は旅客を搭載しないこと\n・救助船には、船長のほか救助を補佐する者１名以上が乗船すること\"","v":"本船（船名を入力してください、船舶番号XXX-XXXXX）は、水域6（選択してください）を航行する際、下記１．又は２．に記載のいずれの安全対策を講じない場合、事業（海上運送法における人の運送を行う事業や遊漁船業）の用に供しない。\n\n１．別表（伴走船_水温②）に掲げる船舶（以下「伴走船」という。）と共に航行する。\n遵守事項\n・３隻以内の伴走船と共に航行すること\n・伴走船の搭載人員は、別表の搭載可能人員を超えることなく、本船の搭載人員分を搭載（救助）できるようにすること\n・伴走船が、出航から帰港まで本船を常に視認でき、かつ、万が一乗客が水中待機した場合であっても早急に救助できる位置を航行すること\n・伴走船には、船長のほか救助を補佐する者１名以上が乗船すること\n　（なお、船員以外の者を補佐人として指定する場合、船長はその者に対し、発航前にその旨を説明し理解を得ること）\n\n２．別表（救助船_水温②）に掲げる船舶（以下「救助船」という。）を配備する。\n遵守事項\n・本船の航路は、救助船の航行区域内とすること\n・救助船は、本船が航行する間、本船から救助の要請があった場合に直ちに救助に向かう位置で待機していること\n・救助船には、救助時に向かう際は旅客を搭載しないこと\n・救助船には、船長のほか救助を補佐する者１名以上が乗船すること"},{"$f":"B1&\"は、水域\"&B2&\"（\"&B3&\"（水温20℃以上となる水域を除く））を航行する際、下記１．又は２．に記載のいずれかの安全対策を講じる。\"&\"\n\n\"&\"１．別表（伴走船_水温②）に掲げる船舶（以下「伴走船」という。）と共に航行する。\n\"&\"遵守事項\n・３隻以内の伴走船と共に航行すること\n・伴走船の搭載人員は、別表の搭載可能人員を超えることなく、本船の搭載人員分を搭載（救助）できるようにすること\n・伴走船が、出航から帰港まで本船を常に視認でき、かつ、万が一乗客が水中待機した場合であっても早急に救助できる位置を航行すること\n・伴走船には、船長のほか救助を補佐する者１名以上が乗船すること\n　（なお、船員以外の者を補佐人として指定する場合、船長はその者に対し、発航前にその旨を説明し理解を得ること）\"&\"\n\n\"&\"２．別表（救助船_水温②）に掲げる船舶（以下「救助船」という。）を配備する。\n\"&\"遵守事項\n・本船の航路は、救助船の航行区域内とすること\n・救助船は、本船が航行する間、本船から救助の要請があった場合に直ちに救助に向かう位置で待機していること\n・救助船には、救助時に向かう際は旅客を搭載しないこと\n・救助船には、船長のほか救助を補佐する者１名以上が乗船すること\"","v":"本船（船名を入力してください、船舶番号XXX-XXXXX）は、水域6（選択してください（水温20℃以上となる水域を除く））を航行する際、下記１．又は２．に記載のいずれかの安全対策を講じる。\n\n１．別表（伴走船_水温②）に掲げる船舶（以下「伴走船」という。）と共に航行する。\n遵守事項\n・３隻以内の伴走船と共に航行すること\n・伴走船の搭載人員は、別表の搭載可能人員を超えることなく、本船の搭載人員分を搭載（救助）できるようにすること\n・伴走船が、出航から帰港まで本船を常に視認でき、かつ、万が一乗客が水中待機した場合であっても早急に救助できる位置を航行すること\n・伴走船には、船長のほか救助を補佐する者１名以上が乗船すること\n　（なお、船員以外の者を補佐人として指定する場合、船長はその者に対し、発航前にその旨を説明し理解を得ること）\n\n２．別表（救助船_水温②）に掲げる船舶（以下「救助船」という。）を配備する。\n遵守事項\n・本船の航路は、救助船の航行区域内とすること\n・救助船は、本船が航行する間、本船から救助の要請があった場合に直ちに救助に向かう位置で待機していること\n・救助船には、救助時に向かう際は旅客を搭載しないこと\n・救助船には、船長のほか救助を補佐する者１名以上が乗船すること"},{"$f":"B1&\"は、水域\"&B2&\"（\"&B3&\"）を航行する際、下記１．に記載の安全対策を講じない場合、\"&C5&\"\n\n\"&\"１．別表（救助船_水温②）に掲げる船舶（以下「救助船」という。）を配備する。\n\"&\"遵守事項\n・本船の航路は、救助船の航行区域内とすること\n・救助船は、本船が航行する間、本船から救助の要請があった場合に直ちに救助に向かう位置で待機していること\n・救助船には、救助時に向かう際は旅客を搭載しないこと\n・救助船には、船長のほか救助を補佐する者１名以上が乗船すること\"","v":"本船（船名を入力してください、船舶番号XXX-XXXXX）は、水域6（選択してください）を航行する際、下記１．に記載の安全対策を講じない場合、事業（海上運送法における人の運送を行う事業や遊漁船業）の用に供しない。\n\n１．別表（救助船_水温②）に掲げる船舶（以下「救助船」という。）を配備する。\n遵守事項\n・本船の航路は、救助船の航行区域内とすること\n・救助船は、本船が航行する間、本船から救助の要請があった場合に直ちに救助に向かう位置で待機していること\n・救助船には、救助時に向かう際は旅客を搭載しないこと\n・救助船には、船長のほか救助を補佐する者１名以上が乗船すること"},{"$f":"B1&\"は、水域\"&B2&\"（\"&B3&\"）を航行する際、下記１．に記載の安全対策を講じない場合、\"&C5&\"\n\n\"&\"１．別表（伴走船_水温②）に掲げる船舶（以下「伴走船」という。）と共に航行する。\n\"&\"遵守事項\n・３隻以内の伴走船と共に航行すること\n・伴走船の搭載人員は、別表の搭載可能人員を超えることなく、本船の搭載人員分を搭載（救助）できるようにすること\n・伴走船が、出航から帰港まで本船を常に視認でき、かつ、万が一乗客が水中待機した場合であっても早急に救助できる位置を航行すること\n・伴走船には、船長のほか救助を補佐する者１名以上が乗船すること\n　（なお、船員以外の者を補佐人として指定する場合、船長はその者に対し、発航前にその旨を説明し理解を得ること）\"","v":"本船（船名を入力してください、船舶番号XXX-XXXXX）は、水域6（選択してください）を航行する際、下記１．に記載の安全対策を講じない場合、事業（海上運送法における人の運送を行う事業や遊漁船業）の用に供しない。\n\n１．別表（伴走船_水温②）に掲げる船舶（以下「伴走船」という。）と共に航行する。\n遵守事項\n・３隻以内の伴走船と共に航行すること\n・伴走船の搭載人員は、別表の搭載可能人員を超えることなく、本船の搭載人員分を搭載（救助）できるようにすること\n・伴走船が、出航から帰港まで本船を常に視認でき、かつ、万が一乗客が水中待機した場合であっても早急に救助できる位置を航行すること\n・伴走船には、船長のほか救助を補佐する者１名以上が乗船すること\n　（なお、船員以外の者を補佐人として指定する場合、船長はその者に対し、発航前にその旨を説明し理解を得ること）"},{"$f":"B1&\"は、水域\"&B2&\"（\"&B3&\"（水温15℃以上であって母港（\"&C4&\"）から５海里以内の水域を除く））を航行する際、下記１．又は２．に記載のいずれの安全対策を講じない場合、\"&C5&\"\n\n\"&\"１．別表（伴走船_水温②）に掲げる船舶（以下「伴走船」という。）と共に航行する。\n\"&\"遵守事項\n・３隻以内の伴走船と共に航行すること\n・伴走船の搭載人員は、別表の搭載可能人員を超えることなく、本船の搭載人員分を搭載（救助）できるようにすること\n・伴走船が、出航から帰港まで本船を常に視認でき、かつ、万が一乗客が水中待機した場合であっても早急に救助できる位置を航行すること\n・伴走船には、船長のほか救助を補佐する者１名以上が乗船すること\n　（なお、船員以外の者を補佐人として指定する場合、船長はその者に対し、発航前にその旨を説明し理解を得ること）\"&\"\n\n\"&\"２．別表（救助船_水温②）に掲げる船舶（以下「救助船」という。）を配備する。\n\"&\"遵守事項\n・本船の航路は、救助船の航行区域内とすること\n・救助船は、本船が航行する間、本船から救助の要請があった場合に直ちに救助に向かう位置で待機していること\n・救助船には、救助時に向かう際は旅客を搭載しないこと\n・救助船には、船長のほか救助を補佐する者１名以上が乗船すること\"","v":"本船（船名を入力してください、船舶番号XXX-XXXXX）は、水域6（選択してください（水温15℃以上であって母港（営業船の母港を入力してください（選択してください選択してください））から５海里以内の水域を除く））を航行する際、下記１．又は２．に記載のいずれの安全対策を講じない場合、事業（海上運送法における人の運送を行う事業や遊漁船業）の用に供しない。\n\n１．別表（伴走船_水温②）に掲げる船舶（以下「伴走船」という。）と共に航行する。\n遵守事項\n・３隻以内の伴走船と共に航行すること\n・伴走船の搭載人員は、別表の搭載可能人員を超えることなく、本船の搭載人員分を搭載（救助）できるようにすること\n・伴走船が、出航から帰港まで本船を常に視認でき、かつ、万が一乗客が水中待機した場合であっても早急に救助できる位置を航行すること\n・伴走船には、船長のほか救助を補佐する者１名以上が乗船すること\n　（なお、船員以外の者を補佐人として指定する場合、船長はその者に対し、発航前にその旨を説明し理解を得ること）\n\n２．別表（救助船_水温②）に掲げる船舶（以下「救助船」という。）を配備する。\n遵守事項\n・本船の航路は、救助船の航行区域内とすること\n・救助船は、本船が航行する間、本船から救助の要請があった場合に直ちに救助に向かう位置で待機していること\n・救助船には、救助時に向かう際は旅客を搭載しないこと\n・救助船には、船長のほか救助を補佐する者１名以上が乗船すること"},{"$f":"B1&\"は、水域\"&B2&\"（\"&B3&\"（水温15℃以上であって母港（\"&C4&\"）から５海里以内の水域と水温20℃以上となる水域を除く））を航行する際、下記１．又は２．に記載のいずれかの安全対策を講じる。\"&\"\n\n\"&\"１．別表（伴走船_水温②）に掲げる船舶（以下「伴走船」という。）と共に航行する。\n\"&\"遵守事項\n・３隻以内の伴走船と共に航行すること\n・伴走船の搭載人員は、別表の搭載可能人員を超えることなく、本船の搭載人員分を搭載（救助）できるようにすること\n・伴走船が、出航から帰港まで本船を常に視認でき、かつ、万が一乗客が水中待機した場合であっても早急に救助できる位置を航行すること\n・伴走船には、船長のほか救助を補佐する者１名以上が乗船すること\n　（なお、船員以外の者を補佐人として指定する場合、船長はその者に対し、発航前にその旨を説明し理解を得ること）\"&\"\n\n\"&\"２．別表（救助船_水温②）に掲げる船舶（以下「救助船」という。）を配備する。\n\"&\"遵守事項\n・本船の航路は、救助船の航行区域内とすること\n・救助船は、本船が航行する間、本船から救助の要請があった場合に直ちに救助に向かう位置で待機していること\n・救助船には、救助時に向かう際は旅客を搭載しないこと\n・救助船には、船長のほか救助を補佐する者１名以上が乗船すること\"","v":"本船（船名を入力してください、船舶番号XXX-XXXXX）は、水域6（選択してください（水温15℃以上であって母港（営業船の母港を入力してください（選択してください選択してください））から５海里以内の水域と水温20℃以上となる水域を除く））を航行する際、下記１．又は２．に記載のいずれかの安全対策を講じる。\n\n１．別表（伴走船_水温②）に掲げる船舶（以下「伴走船」という。）と共に航行する。\n遵守事項\n・３隻以内の伴走船と共に航行すること\n・伴走船の搭載人員は、別表の搭載可能人員を超えることなく、本船の搭載人員分を搭載（救助）できるようにすること\n・伴走船が、出航から帰港まで本船を常に視認でき、かつ、万が一乗客が水中待機した場合であっても早急に救助できる位置を航行すること\n・伴走船には、船長のほか救助を補佐する者１名以上が乗船すること\n　（なお、船員以外の者を補佐人として指定する場合、船長はその者に対し、発航前にその旨を説明し理解を得ること）\n\n２．別表（救助船_水温②）に掲げる船舶（以下「救助船」という。）を配備する。\n遵守事項\n・本船の航路は、救助船の航行区域内とすること\n・救助船は、本船が航行する間、本船から救助の要請があった場合に直ちに救助に向かう位置で待機していること\n・救助船には、救助時に向かう際は旅客を搭載しないこと\n・救助船には、船長のほか救助を補佐する者１名以上が乗船すること"},{"$f":"B1&\"は、水域\"&B2&\"（\"&B3&\"（水温15℃以上であって母港（\"&C4&\"）から５海里以内の水域））を航行する際、下記１．に記載の安全対策を講じない場合、\"&C5&\"\n\n\"&\"１．別表（救助船_水温②）に掲げる船舶（以下「救助船」という。）を配備する。\n\"&\"遵守事項\n・本船の航路は、救助船の航行区域内とすること\n・救助船は、本船が航行する間、本船から救助の要請があった場合に直ちに救助に向かう位置で待機していること\n・救助船には、救助時に向かう際は旅客を搭載しないこと\n・救助船には、船長のほか救助を補佐する者１名以上が乗船すること\"","v":"本船（船名を入力してください、船舶番号XXX-XXXXX）は、水域6（選択してください（水温15℃以上であって母港（営業船の母港を入力してください（選択してください選択してください））から５海里以内の水域））を航行する際、下記１．に記載の安全対策を講じない場合、事業（海上運送法における人の運送を行う事業や遊漁船業）の用に供しない。\n\n１．別表（救助船_水温②）に掲げる船舶（以下「救助船」という。）を配備する。\n遵守事項\n・本船の航路は、救助船の航行区域内とすること\n・救助船は、本船が航行する間、本船から救助の要請があった場合に直ちに救助に向かう位置で待機していること\n・救助船には、救助時に向かう際は旅客を搭載しないこと\n・救助船には、船長のほか救助を補佐する者１名以上が乗船すること"},{"$f":"B1&\"は、水域\"&B2&\"（\"&B3&\"（水温15℃以上であって母港（\"&C4&\"）から５海里以内の水域））を航行する際、\"&C5","v":"本船（船名を入力してください、船舶番号XXX-XXXXX）は、水域6（選択してください（水温15℃以上であって母港（営業船の母港を入力してください（選択してください選択してください））から５海里以内の水域））を航行する際、事業（海上運送法における人の運送を行う事業や遊漁船業）の用に供しない。"},{"$f":"B1&\"は、水域\"&B2&\"（\"&B3&\"（水温15℃以上であって母港（\"&C4&\"）から５海里以内の水域と水温20℃以上となる水域を除く））を航行する際、別表（救助船_水温②）に掲げる船舶（以下「救助船」という。）を配備する。\n\"&\"\n遵守事項\n・本船の航路は、救助船の航行区域内とすること\n・救助船は、本船が航行する間、本船から救助の要請があった場合に直ちに救助に向かう位置で待機していること\n・救助船には、救助時に向かう際は旅客を搭載しないこと\n・救助船には、船長のほか救助を補佐する者１名以上が乗船すること\"","v":"本船（船名を入力してください、船舶番号XXX-XXXXX）は、水域6（選択してください（水温15℃以上であって母港（営業船の母港を入力してください（選択してください選択してください））から５海里以内の水域と水温20℃以上となる水域を除く））を航行する際、別表（救助船_水温②）に掲げる船舶（以下「救助船」という。）を配備する。\n\n遵守事項\n・本船の航路は、救助船の航行区域内とすること\n・救助船は、本船が航行する間、本船から救助の要請があった場合に直ちに救助に向かう位置で待機していること\n・救助船には、救助時に向かう際は旅客を搭載しないこと\n・救助船には、船長のほか救助を補佐する者１名以上が乗船すること"},{"$f":"B1&\"は、水域\"&B2&\"（\"&B3&\"（水温15℃以上であって母港（\"&C4&\"）から５海里以内の水域を除く））を航行する際、下記１．に記載の安全対策を講じない場合、\"&C5&\"\n\n\"&\"１．別表（伴走船_水温②）に掲げる船舶（以下「伴走船」という。）と共に航行する。\n\"&\"遵守事項\n・３隻以内の伴走船と共に航行すること\n・伴走船の搭載人員は、別表の搭載可能人員を超えることなく、本船の搭載人員分を搭載（救助）できるようにすること\n・伴走船が、出航から帰港まで本船を常に視認でき、かつ、万が一乗客が水中待機した場合であっても早急に救助できる位置を航行すること\n・伴走船には、船長のほか救助を補佐する者１名以上が乗船すること\n　（なお、船員以外の者を補佐人として指定する場合、船長はその者に対し、発航前にその旨を説明し理解を得ること）\"","v":"本船（船名を入力してください、船舶番号XXX-XXXXX）は、水域6（選択してください（水温15℃以上であって母港（営業船の母港を入力してください（選択してください選択してください））から５海里以内の水域を除く））を航行する際、下記１．に記載の安全対策を講じない場合、事業（海上運送法における人の運送を行う事業や遊漁船業）の用に供しない。\n\n１．別表（伴走船_水温②）に掲げる船舶（以下「伴走船」という。）と共に航行する。\n遵守事項\n・３隻以内の伴走船と共に航行すること\n・伴走船の搭載人員は、別表の搭載可能人員を超えることなく、本船の搭載人員分を搭載（救助）できるようにすること\n・伴走船が、出航から帰港まで本船を常に視認でき、かつ、万が一乗客が水中待機した場合であっても早急に救助できる位置を航行すること\n・伴走船には、船長のほか救助を補佐する者１名以上が乗船すること\n　（なお、船員以外の者を補佐人として指定する場合、船長はその者に対し、発航前にその旨を説明し理解を得ること）"},{"$f":"B1&\"は、水域\"&B2&\"（\"&B3&\"（水温15℃以上であって母港（\"&C4&\"）から５海里以内の水域と水温20℃以上となる水域を除く））を航行する際、別表（伴走船_水温②）に掲げる船舶（以下「伴走船」という。）と共に航行する。\n\"&\"\n遵守事項\n・３隻以内の伴走船と共に航行すること\n・伴走船の搭載人員は、別表の搭載可能人員を超えることなく、本船の搭載人員分を搭載（救助）できるようにすること\n・伴走船が、出航から帰港まで本船を常に視認でき、かつ、万が一乗客が水中待機した場合であっても早急に救助できる位置を航行すること\n・伴走船には、船長のほか救助を補佐する者１名以上が乗船すること\n　（なお、船員以外の者を補佐人として指定する場合、船長はその者に対し、発航前にその旨を説明し理解を得ること）\"","v":"本船（船名を入力してください、船舶番号XXX-XXXXX）は、水域6（選択してください（水温15℃以上であって母港（営業船の母港を入力してください（選択してください選択してください））から５海里以内の水域と水温20℃以上となる水域を除く））を航行する際、別表（伴走船_水温②）に掲げる船舶（以下「伴走船」という。）と共に航行する。\n\n遵守事項\n・３隻以内の伴走船と共に航行すること\n・伴走船の搭載人員は、別表の搭載可能人員を超えることなく、本船の搭載人員分を搭載（救助）できるようにすること\n・伴走船が、出航から帰港まで本船を常に視認でき、かつ、万が一乗客が水中待機した場合であっても早急に救助できる位置を航行すること\n・伴走船には、船長のほか救助を補佐する者１名以上が乗船すること\n　（なお、船員以外の者を補佐人として指定する場合、船長はその者に対し、発航前にその旨を説明し理解を得ること）"},{"$f":"B1&\"は、水域\"&B2&\"（\"&B3&\"（水温15℃以上となる水域を除く））を航行する際、下記１．又は２．に記載のいずれの安全対策を講じない場合、\"&C5&\"\n\n\"&\"１．別表（伴走船_水温②）に掲げる船舶（以下「伴走船」という。）と共に航行する。\n\"&\"遵守事項\n・３隻以内の伴走船と共に航行すること\n・伴走船の搭載人員は、別表の搭載可能人員を超えることなく、本船の搭載人員分を搭載（救助）できるようにすること\n・伴走船が、出航から帰港まで本船を常に視認でき、かつ、万が一乗客が水中待機した場合であっても早急に救助できる位置を航行すること\n・伴走船には、船長のほか救助を補佐する者１名以上が乗船すること\n　（なお、船員以外の者を補佐人として指定する場合、船長はその者に対し、発航前にその旨を説明し理解を得ること）\"&\"\n\n\"&\"２．別表（救助船_水温②）に掲げる船舶（以下「救助船」という。）を配備する。\n\"&\"遵守事項\n・本船の航路は、救助船の航行区域内とすること\n・救助船は、本船が航行する間、本船から救助の要請があった場合に直ちに救助に向かう位置で待機していること\n・救助船には、救助時に向かう際は旅客を搭載しないこと\n・救助船には、船長のほか救助を補佐する者１名以上が乗船すること\"","v":"本船（船名を入力してください、船舶番号XXX-XXXXX）は、水域6（選択してください（水温15℃以上となる水域を除く））を航行する際、下記１．又は２．に記載のいずれの安全対策を講じない場合、事業（海上運送法における人の運送を行う事業や遊漁船業）の用に供しない。\n\n１．別表（伴走船_水温②）に掲げる船舶（以下「伴走船」という。）と共に航行する。\n遵守事項\n・３隻以内の伴走船と共に航行すること\n・伴走船の搭載人員は、別表の搭載可能人員を超えることなく、本船の搭載人員分を搭載（救助）できるようにすること\n・伴走船が、出航から帰港まで本船を常に視認でき、かつ、万が一乗客が水中待機した場合であっても早急に救助できる位置を航行すること\n・伴走船には、船長のほか救助を補佐する者１名以上が乗船すること\n　（なお、船員以外の者を補佐人として指定する場合、船長はその者に対し、発航前にその旨を説明し理解を得ること）\n\n２．別表（救助船_水温②）に掲げる船舶（以下「救助船」という。）を配備する。\n遵守事項\n・本船の航路は、救助船の航行区域内とすること\n・救助船は、本船が航行する間、本船から救助の要請があった場合に直ちに救助に向かう位置で待機していること\n・救助船には、救助時に向かう際は旅客を搭載しないこと\n・救助船には、船長のほか救助を補佐する者１名以上が乗船すること"},{"$f":"B1&\"は、水域\"&B2&\"（\"&B3&\"（水温15℃以上となる水域を除く））を航行する際、下記１．又は２．に記載のいずれかの安全対策を講じる。\"&\"\n\n\"&\"１．別表（伴走船_水温②）に掲げる船舶（以下「伴走船」という。）と共に航行する。\n\"&\"遵守事項\n・３隻以内の伴走船と共に航行すること\n・伴走船の搭載人員は、別表の搭載可能人員を超えることなく、本船の搭載人員分を搭載（救助）できるようにすること\n・伴走船が、出航から帰港まで本船を常に視認でき、かつ、万が一乗客が水中待機した場合であっても早急に救助できる位置を航行すること\n・伴走船には、船長のほか救助を補佐する者１名以上が乗船すること\n　（なお、船員以外の者を補佐人として指定する場合、船長はその者に対し、発航前にその旨を説明し理解を得ること）\"&\"\n\n\"&\"２．別表（救助船_水温②）に掲げる船舶（以下「救助船」という。）を配備する。\n\"&\"遵守事項\n・本船の航路は、救助船の航行区域内とすること\n・救助船は、本船が航行する間、本船から救助の要請があった場合に直ちに救助に向かう位置で待機していること\n・救助船には、救助時に向かう際は旅客を搭載しないこと\n・救助船には、船長のほか救助を補佐する者１名以上が乗船すること\"","v":"本船（船名を入力してください、船舶番号XXX-XXXXX）は、水域6（選択してください（水温15℃以上となる水域を除く））を航行する際、下記１．又は２．に記載のいずれかの安全対策を講じる。\n\n１．別表（伴走船_水温②）に掲げる船舶（以下「伴走船」という。）と共に航行する。\n遵守事項\n・３隻以内の伴走船と共に航行すること\n・伴走船の搭載人員は、別表の搭載可能人員を超えることなく、本船の搭載人員分を搭載（救助）できるようにすること\n・伴走船が、出航から帰港まで本船を常に視認でき、かつ、万が一乗客が水中待機した場合であっても早急に救助できる位置を航行すること\n・伴走船には、船長のほか救助を補佐する者１名以上が乗船すること\n　（なお、船員以外の者を補佐人として指定する場合、船長はその者に対し、発航前にその旨を説明し理解を得ること）\n\n２．別表（救助船_水温②）に掲げる船舶（以下「救助船」という。）を配備する。\n遵守事項\n・本船の航路は、救助船の航行区域内とすること\n・救助船は、本船が航行する間、本船から救助の要請があった場合に直ちに救助に向かう位置で待機していること\n・救助船には、救助時に向かう際は旅客を搭載しないこと\n・救助船には、船長のほか救助を補佐する者１名以上が乗船すること"},{"$f":"B1&\"は、水域\"&B2&\"（\"&B3&\"（水温15℃以上となる水域を除く））を航行する際、下記１．に記載の安全対策を講じない場合、\"&C5&\"\n\n\"&\"１．別表（救助船_水温②）に掲げる船舶（以下「救助船」という。）を配備する。\n\"&\"遵守事項\n・本船の航路は、救助船の航行区域内とすること\n・救助船は、本船が航行する間、本船から救助の要請があった場合に直ちに救助に向かう位置で待機していること\n・救助船には、救助時に向かう際は旅客を搭載しないこと\n・救助船には、船長のほか救助を補佐する者１名以上が乗船すること\"","v":"本船（船名を入力してください、船舶番号XXX-XXXXX）は、水域6（選択してください（水温15℃以上となる水域を除く））を航行する際、下記１．に記載の安全対策を講じない場合、事業（海上運送法における人の運送を行う事業や遊漁船業）の用に供しない。\n\n１．別表（救助船_水温②）に掲げる船舶（以下「救助船」という。）を配備する。\n遵守事項\n・本船の航路は、救助船の航行区域内とすること\n・救助船は、本船が航行する間、本船から救助の要請があった場合に直ちに救助に向かう位置で待機していること\n・救助船には、救助時に向かう際は旅客を搭載しないこと\n・救助船には、船長のほか救助を補佐する者１名以上が乗船すること"},{"$f":"B1&\"は、水域\"&B2&\"（\"&B3&\"）のうち水温15℃未満となる水域を航行する際、\"&C5","v":"本船（船名を入力してください、船舶番号XXX-XXXXX）は、水域6（選択してください）のうち水温15℃未満となる水域を航行する際、事業（海上運送法における人の運送を行う事業や遊漁船業）の用に供しない。"},{"$f":"B1&\"は、水域\"&B2&\"（\"&B3&\"（水温15℃以上となる水域を除く））を航行する際、別表（救助船_水温②）に掲げる船舶（以下「救助船」という。）を配備する。\n\"&\"\n遵守事項\n・本船の航路は、救助船の航行区域内とすること\n・救助船は、本船が航行する間、本船から救助の要請があった場合に直ちに救助に向かう位置で待機していること\n・救助船には、救助時に向かう際は旅客を搭載しないこと\n・救助船には、船長のほか救助を補佐する者１名以上が乗船すること\"","v":"本船（船名を入力してください、船舶番号XXX-XXXXX）は、水域6（選択してください（水温15℃以上となる水域を除く））を航行する際、別表（救助船_水温②）に掲げる船舶（以下「救助船」という。）を配備する。\n\n遵守事項\n・本船の航路は、救助船の航行区域内とすること\n・救助船は、本船が航行する間、本船から救助の要請があった場合に直ちに救助に向かう位置で待機していること\n・救助船には、救助時に向かう際は旅客を搭載しないこと\n・救助船には、船長のほか救助を補佐する者１名以上が乗船すること"},{"$f":"B1&\"は、水域\"&B2&\"（\"&B3&\"（水温15℃以上となる水域を除く））を航行する際、下記１．に記載の安全対策を講じない場合、\"&C5&\"\n\n\"&\"１．別表（伴走船_水温②）に掲げる船舶（以下「伴走船」という。）と共に航行する。\n\"&\"遵守事項\n・３隻以内の伴走船と共に航行すること\n・伴走船の搭載人員は、別表の搭載可能人員を超えることなく、本船の搭載人員分を搭載（救助）できるようにすること\n・伴走船が、出航から帰港まで本船を常に視認でき、かつ、万が一乗客が水中待機した場合であっても早急に救助できる位置を航行すること\n・伴走船には、船長のほか救助を補佐する者１名以上が乗船すること\n　（なお、船員以外の者を補佐人として指定する場合、船長はその者に対し、発航前にその旨を説明し理解を得ること）\"","v":"本船（船名を入力してください、船舶番号XXX-XXXXX）は、水域6（選択してください（水温15℃以上となる水域を除く））を航行する際、下記１．に記載の安全対策を講じない場合、事業（海上運送法における人の運送を行う事業や遊漁船業）の用に供しない。\n\n１．別表（伴走船_水温②）に掲げる船舶（以下「伴走船」という。）と共に航行する。\n遵守事項\n・３隻以内の伴走船と共に航行すること\n・伴走船の搭載人員は、別表の搭載可能人員を超えることなく、本船の搭載人員分を搭載（救助）できるようにすること\n・伴走船が、出航から帰港まで本船を常に視認でき、かつ、万が一乗客が水中待機した場合であっても早急に救助できる位置を航行すること\n・伴走船には、船長のほか救助を補佐する者１名以上が乗船すること\n　（なお、船員以外の者を補佐人として指定する場合、船長はその者に対し、発航前にその旨を説明し理解を得ること）"},{"$f":"B1&\"は、水域\"&B2&\"（\"&B3&\"（水温15℃以上となる水域を除く））を航行する際、別表（伴走船_水温②）に掲げる船舶（以下「伴走船」という。）と共に航行する。\n\"&\"\n遵守事項\n・３隻以内の伴走船と共に航行すること\n・伴走船の搭載人員は、別表の搭載可能人員を超えることなく、本船の搭載人員分を搭載（救助）できるようにすること\n・伴走船が、出航から帰港まで本船を常に視認でき、かつ、万が一乗客が水中待機した場合であっても早急に救助できる位置を航行すること\n・伴走船には、船長のほか救助を補佐する者１名以上が乗船すること\n　（なお、船員以外の者を補佐人として指定する場合、船長はその者に対し、発航前にその旨を説明し理解を得ること）\"","v":"本船（船名を入力してください、船舶番号XXX-XXXXX）は、水域6（選択してください（水温15℃以上となる水域を除く））を航行する際、別表（伴走船_水温②）に掲げる船舶（以下「伴走船」という。）と共に航行する。\n\n遵守事項\n・３隻以内の伴走船と共に航行すること\n・伴走船の搭載人員は、別表の搭載可能人員を超えることなく、本船の搭載人員分を搭載（救助）できるようにすること\n・伴走船が、出航から帰港まで本船を常に視認でき、かつ、万が一乗客が水中待機した場合であっても早急に救助できる位置を航行すること\n・伴走船には、船長のほか救助を補佐する者１名以上が乗船すること\n　（なお、船員以外の者を補佐人として指定する場合、船長はその者に対し、発航前にその旨を説明し理解を得ること）"}]
["水温③（航行する水域の中に水温15℃以上20℃未満となる水域が含まれる時期（水温①、水温②の時期を除く。））",null,null,null,{"$f":"B1&\"は、水域\"&B2&\"（\"&B3&\"）を航行する際、\"&D5","v":"本船（船名を入力してください、船舶番号XXX-XXXXX）は、水域6（選択してください）を航行する際、事業（海上運送法における人の運送を行う事業や遊漁船業）の用に供しない。"},{"$f":"B1&\"は、水域\"&B2&\"（\"&B3&\"（水温20℃以上となる水域を除く））を航行する際、別表（伴走船_水温③）に掲げる船舶（以下「伴走船」という。）と共に航行する。\"&\"\n\n\"&\"遵守事項\n・３隻以内の伴走船と共に航行すること\n・伴走船の搭載人員は、別表の搭載可能人員を超えることなく、本船の搭載人員分を搭載（救助）できるようにすること\n・伴走船が、出航から帰港まで本船を常に視認でき、かつ、万が一乗客が水中待機した場合であっても早急に救助できる位置を航行すること\n・伴走船には、船長のほか救助を補佐する者１名以上が乗船すること\n　（なお、船員以外の者を補佐人として指定する場合、船長はその者に対し、発航前にその旨を説明し理解を得ること）\"","v":"本船（船名を入力してください、船舶番号XXX-XXXXX）は、水域6（選択してください（水温20℃以上となる水域を除く））を航行する際、別表（伴走船_水温③）に掲げる船舶（以下「伴走船」という。）と共に航行する。\n\n遵守事項\n・３隻以内の伴走船と共に航行すること\n・伴走船の搭載人員は、別表の搭載可能人員を超えることなく、本船の搭載人員分を搭載（救助）できるようにすること\n・伴走船が、出航から帰港まで本船を常に視認でき、かつ、万が一乗客が水中待機した場合であっても早急に救助できる位置を航行すること\n・伴走船には、船長のほか救助を補佐する者１名以上が乗船すること\n　（なお、船員以外の者を補佐人として指定する場合、船長はその者に対し、発航前にその旨を説明し理解を得ること）"},{"$f":"B1&\"は、水域\"&B2&\"（\"&B3&\"（水温20℃以上となる水域を除く））を航行する際、別表（救助船_水温③）に掲げる船舶（以下「救助船」という。）を配備する。\"&\"\n\n\"&\"遵守事項\n・本船の航路は、救助船の航行区域内とすること\n・救助船は、本船が航行する間、本船から救助の要請があった場合に直ちに救助に向かう位置で待機していること\n・救助船には、救助時に向かう際は旅客を搭載しないこと\n・救助船には、船長のほか救助を補佐する者１名以上が乗船すること\"","v":"本船（船名を入力してください、船舶番号XXX-XXXXX）は、水域6（選択してください（水温20℃以上となる水域を除く））を航行する際、別表（救助船_水温③）に掲げる船舶（以下「救助船」という。）を配備する。\n\n遵守事項\n・本船の航路は、救助船の航行区域内とすること\n・救助船は、本船が航行する間、本船から救助の要請があった場合に直ちに救助に向かう位置で待機していること\n・救助船には、救助時に向かう際は旅客を搭載しないこと\n・救助船には、船長のほか救助を補佐する者１名以上が乗船すること"},{"$f":"B1&\"は、水域\"&B2&\"（\"&B3&\"）を航行する水密全通甲板（又は不沈性及び安定性）を有する船舶である。\"","v":"本船（船名を入力してください、船舶番号XXX-XXXXX）は、水域6（選択してください）を航行する水密全通甲板（又は不沈性及び安定性）を有する船舶である。"},{"$f":"B1&\"は、水域\"&B2&\"（\"&B3&\"（水温20℃以上となる水域を除く））を航行する際、母港\"&D4&\"からの航行距離が５海里以内の範囲内のみ航行する。\"","v":"本船（船名を入力してください、船舶番号XXX-XXXXX）は、水域6（選択してください（水温20℃以上となる水域を除く））を航行する際、母港営業船の母港を入力してください（選択してください選択してください）からの航行距離が５海里以内の範囲内のみ航行する。"},{"$f":"B1&\"は、水域\"&B2&\"（\"&B3&\"）を航行する際、下記１．又は２．に記載のいずれの安全対策を講じない場合、\"&D5&\"\n\n\"&\"１．別表（伴走船_水温③）に掲げる船舶（以下「伴走船」という。）と共に航行する。\n\"&\"遵守事項\n・３隻以内の伴走船と共に航行すること\n・伴走船の搭載人員は、別表の搭載可能人員を超えることなく、本船の搭載人員分を搭載（救助）できるようにすること\n・伴走船が、出航から帰港まで本船を常に視認でき、かつ、万が一乗客が水中待機した場合であっても早急に救助できる位置を航行すること\n・伴走船には、船長のほか救助を補佐する者１名以上が乗船すること\n　（なお、船員以外の者を補佐人として指定する場合、船長はその者に対し、発航前にその旨を説明し理解を得ること）\"&\"\n\n\"&\"２．別表（救助船_水温③）に掲げる船舶（以下「救助船」という。）を配備する。\n\"&\"遵守事項\n・本船の航路は、救助船の航行区域内とすること\n・救助船は、本船が航行する間、本船から救助の要請があった場合に直ちに救助に向かう位置で待機していること\n・救助船には、救助時に向かう際は旅客を搭載しないこと\n・救助船には、船長のほか救助を補佐する者１名以上が乗船すること\"","v":"本船（船名を入力してください、船舶番号XXX-XXXXX）は、水域6（選択してください）を航行する際、下記１．又は２．に記載のいずれの安全対策を講じない場合、事業（海上運送法における人の運送を行う事業や遊漁船業）の用に供しない。\n\n１．別表（伴走船_水温③）に掲げる船舶（以下「伴走船」という。）と共に航行する。\n遵守事項\n・３隻以内の伴走船と共に航行すること\n・伴走船の搭載人員は、別表の搭載可能人員を超えることなく、本船の搭載人員分を搭載（救助）できるようにすること\n・伴走船が、出航から帰港まで本船を常に視認でき、かつ、万が一乗客が水中待機した場合であっても早急に救助できる位置を航行すること\n・伴走船には、船長のほか救助を補佐する者１名以上が乗船すること\n　（なお、船員以外の者を補佐人として指定する場合、船長はその者に対し、発航前にその旨を説明し理解を得ること）\n\n２．別表（救助船_水温③）に掲げる船舶（以下「救助船」という。）を配備する。\n遵守事項\n・本船の航路は、救助船の航行区域内とすること\n・救助船は、本船が航行する間、本船から救助の要請があった場合に直ちに救助に向かう位置で待機していること\n・救助船には、救助時に向かう際は旅客を搭載しないこと\n・救助船には、船長のほか救助を補佐する者１名以上が乗船すること"},{"$f":"B1&\"は、水域\"&B2&\"（\"&B3&\"（水温20℃以上となる水域を除く））を航行する際、下記１．又は２．に記載のいずれかの安全対策を講じる。\"&\"\n\n\"&\"１．別表（伴走船_水温③）に掲げる船舶（以下「伴走船」という。）と共に航行する。\n\"&\"遵守事項\n・３隻以内の伴走船と共に航行すること\n・伴走船の搭載人員は、別表の搭載可能人員を超えることなく、本船の搭載人員分を搭載（救助）できるようにすること\n・伴走船が、出航から帰港まで本船を常に視認でき、かつ、万が一乗客が水中待機した場合であっても早急に救助できる位置を航行すること\n・伴走船には、船長のほか救助を補佐する者１名以上が乗船すること\n　（なお、船員以外の者を補佐人として指定する場合、船長はその者に対し、発航前にその旨を説明し理解を得ること）\"&\"\n\n\"&\"２．別表（救助船_水温③）に掲げる船舶（以下「救助船」という。）を配備する。\n\"&\"遵守事項\n・本船の航路は、救助船の航行区域内とすること\n・救助船は、本船が航行する間、本船から救助の要請があった場合に直ちに救助に向かう位置で待機していること\n・救助船には、救助時に向かう際は旅客を搭載しないこと\n・救助船には、船長のほか救助を補佐する者１名以上が乗船すること\"","v":"本船（船名を入力してください、船舶番号XXX-XXXXX）は、水域6（選択してください（水温20℃以上となる水域を除く））を航行する際、下記１．又は２．に記載のいずれかの安全対策を講じる。\n\n１．別表（伴走船_水温③）に掲げる船舶（以下「伴走船」という。）と共に航行する。\n遵守事項\n・３隻以内の伴走船と共に航行すること\n・伴走船の搭載人員は、別表の搭載可能人員を超えることなく、本船の搭載人員分を搭載（救助）できるようにすること\n・伴走船が、出航から帰港まで本船を常に視認でき、かつ、万が一乗客が水中待機した場合であっても早急に救助できる位置を航行すること\n・伴走船には、船長のほか救助を補佐する者１名以上が乗船すること\n　（なお、船員以外の者を補佐人として指定する場合、船長はその者に対し、発航前にその旨を説明し理解を得ること）\n\n２．別表（救助船_水温③）に掲げる船舶（以下「救助船」という。）を配備する。\n遵守事項\n・本船の航路は、救助船の航行区域内とすること\n・救助船は、本船が航行する間、本船から救助の要請があった場合に直ちに救助に向かう位置で待機していること\n・救助船には、救助時に向かう際は旅客を搭載しないこと\n・救助船には、船長のほか救助を補佐する者１名以上が乗船すること"},{"$f":"B1&\"は、水域\"&B2&\"（\"&B3&\"）を航行する際、下記１．に記載の安全対策を講じない場合、\"&D5&\"\n\n\"&\"１．別表（救助船_水温③）に掲げる船舶（以下「救助船」という。）を配備する。\n\"&\"遵守事項\n・本船の航路は、救助船の航行区域内とすること\n・救助船は、本船が航行する間、本船から救助の要請があった場合に直ちに救助に向かう位置で待機していること\n・救助船には、救助時に向かう際は旅客を搭載しないこと\n・救助船には、船長のほか救助を補佐する者１名以上が乗船すること\"","v":"本船（船名を入力してください、船舶番号XXX-XXXXX）は、水域6（選択してください）を航行する際、下記１．に記載の安全対策を講じない場合、事業（海上運送法における人の運送を行う事業や遊漁船業）の用に供しない。\n\n１．別表（救助船_水温③）に掲げる船舶（以下「救助船」という。）を配備する。\n遵守事項\n・本船の航路は、救助船の航行区域内とすること\n・救助船は、本船が航行する間、本船から救助の要請があった場合に直ちに救助に向かう位置で待機していること\n・救助船には、救助時に向かう際は旅客を搭載しないこと\n・救助船には、船長のほか救助を補佐する者１名以上が乗船すること"},{"$f":"B1&\"は、水域\"&B2&\"（\"&B3&\"）を航行する際、下記１．に記載の安全対策を講じない場合、\"&D5&\"\n\n\"&\"１．別表（伴走船_水温③）に掲げる船舶（以下「伴走船」という。）と共に航行する。\n\"&\"遵守事項\n・３隻以内の伴走船と共に航行すること\n・伴走船の搭載人員は、別表の搭載可能人員を超えることなく、本船の搭載人員分を搭載（救助）できるようにすること\n・伴走船が、出航から帰港まで本船を常に視認でき、かつ、万が一乗客が水中待機した場合であっても早急に救助できる位置を航行すること\n・伴走船には、船長のほか救助を補佐する者１名以上が乗船すること\n　（なお、船員以外の者を補佐人として指定する場合、船長はその者に対し、発航前にその旨を説明し理解を得ること）\"","v":"本船（船名を入力してください、船舶番号XXX-XXXXX）は、水域6（選択してください）を航行する際、下記１．に記載の安全対策を講じない場合、事業（海上運送法における人の運送を行う事業や遊漁船業）の用に供しない。\n\n１．別表（伴走船_水温③）に掲げる船舶（以下「伴走船」という。）と共に航行する。\n遵守事項\n・３隻以内の伴走船と共に航行すること\n・伴走船の搭載人員は、別表の搭載可能人員を超えることなく、本船の搭載人員分を搭載（救助）できるようにすること\n・伴走船が、出航から帰港まで本船を常に視認でき、かつ、万が一乗客が水中待機した場合であっても早急に救助できる位置を航行すること\n・伴走船には、船長のほか救助を補佐する者１名以上が乗船すること\n　（なお、船員以外の者を補佐人として指定する場合、船長はその者に対し、発航前にその旨を説明し理解を得ること）"},{"$f":"B1&\"は、水域\"&B2&\"（\"&B3&\"（水温15℃以上であって母港（\"&D4&\"）から５海里以内の水域を除く））を航行する際、下記１．又は２．に記載のいずれの安全対策を講じない場合、\"&D5&\"\n\n\"&\"１．別表（伴走船_水温③）に掲げる船舶（以下「伴走船」という。）と共に航行する。\n\"&\"遵守事項\n・３隻以内の伴走船と共に航行すること\n・伴走船の搭載人員は、別表の搭載可能人員を超えることなく、本船の搭載人員分を搭載（救助）できるようにすること\n・伴走船が、出航から帰港まで本船を常に視認でき、かつ、万が一乗客が水中待機した場合であっても早急に救助できる位置を航行すること\n・伴走船には、船長のほか救助を補佐する者１名以上が乗船すること\n　（なお、船員以外の者を補佐人として指定する場合、船長はその者に対し、発航前にその旨を説明し理解を得ること）\"&\"\n\n\"&\"２．別表（救助船_水温③）に掲げる船舶（以下「救助船」という。）を配備する。\n\"&\"遵守事項\n・本船の航路は、救助船の航行区域内とすること\n・救助船は、本船が航行する間、本船から救助の要請があった場合に直ちに救助に向かう位置で待機していること\n・救助船には、救助時に向かう際は旅客を搭載しないこと\n・救助船には、船長のほか救助を補佐する者１名以上が乗船すること\"","v":"本船（船名を入力してください、船舶番号XXX-XXXXX）は、水域6（選択してください（水温15℃以上であって母港（営業船の母港を入力してください（選択してください選択してください））から５海里以内の水域を除く））を航行する際、下記１．又は２．に記載のいずれの安全対策を講じない場合、事業（海上運送法における人の運送を行う事業や遊漁船業）の用に供しない。\n\n１．別表（伴走船_水温③）に掲げる船舶（以下「伴走船」という。）と共に航行する。\n遵守事項\n・３隻以内の伴走船と共に航行すること\n・伴走船の搭載人員は、別表の搭載可能人員を超えることなく、本船の搭載人員分を搭載（救助）できるようにすること\n・伴走船が、出航から帰港まで本船を常に視認でき、かつ、万が一乗客が水中待機した場合であっても早急に救助できる位置を航行すること\n・伴走船には、船長のほか救助を補佐する者１名以上が乗船すること\n　（なお、船員以外の者を補佐人として指定する場合、船長はその者に対し、発航前にその旨を説明し理解を得ること）\n\n２．別表（救助船_水温③）に掲げる船舶（以下「救助船」という。）を配備する。\n遵守事項\n・本船の航路は、救助船の航行区域内とすること\n・救助船は、本船が航行する間、本船から救助の要請があった場合に直ちに救助に向かう位置で待機していること\n・救助船には、救助時に向かう際は旅客を搭載しないこと\n・救助船には、船長のほか救助を補佐する者１名以上が乗船すること"},{"$f":"B1&\"は、水域\"&B2&\"（\"&B3&\"（水温15℃以上であって母港（\"&D4&\"）から５海里以内の水域と水温20℃以上となる水域を除く））を航行する際、下記１．又は２．に記載のいずれかの安全対策を講じる。\"&\"\n\n\"&\"１．別表（伴走船_水温③）に掲げる船舶（以下「伴走船」という。）と共に航行する。\n\"&\"遵守事項\n・３隻以内の伴走船と共に航行すること\n・伴走船の搭載人員は、別表の搭載可能人員を超えることなく、本船の搭載人員分を搭載（救助）できるようにすること\n・伴走船が、出航から帰港まで本船を常に視認でき、かつ、万が一乗客が水中待機した場合であっても早急に救助できる位置を航行すること\n・伴走船には、船長のほか救助を補佐する者１名以上が乗船すること\n　（なお、船員以外の者を補佐人として指定する場合、船長はその者に対し、発航前にその旨を説明し理解を得ること）\"&\"\n\n\"&\"２．別表（救助船_水温③）に掲げる船舶（以下「救助船」という。）を配備する。\n\"&\"遵守事項\n・本船の航路は、救助船の航行区域内とすること\n・救助船は、本船が航行する間、本船から救助の要請があった場合に直ちに救助に向かう位置で待機していること\n・救助船には、救助時に向かう際は旅客を搭載しないこと\n・救助船には、船長のほか救助を補佐する者１名以上が乗船すること\"","v":"本船（船名を入力してください、船舶番号XXX-XXXXX）は、水域6（選択してください（水温15℃以上であって母港（営業船の母港を入力してください（選択してください選択してください））から５海里以内の水域と水温20℃以上となる水域を除く））を航行する際、下記１．又は２．に記載のいずれかの安全対策を講じる。\n\n１．別表（伴走船_水温③）に掲げる船舶（以下「伴走船」という。）と共に航行する。\n遵守事項\n・３隻以内の伴走船と共に航行すること\n・伴走船の搭載人員は、別表の搭載可能人員を超えることなく、本船の搭載人員分を搭載（救助）できるようにすること\n・伴走船が、出航から帰港まで本船を常に視認でき、かつ、万が一乗客が水中待機した場合であっても早急に救助できる位置を航行すること\n・伴走船には、船長のほか救助を補佐する者１名以上が乗船すること\n　（なお、船員以外の者を補佐人として指定する場合、船長はその者に対し、発航前にその旨を説明し理解を得ること）\n\n２．別表（救助船_水温③）に掲げる船舶（以下「救助船」という。）を配備する。\n遵守事項\n・本船の航路は、救助船の航行区域内とすること\n・救助船は、本船が航行する間、本船から救助の要請があった場合に直ちに救助に向かう位置で待機していること\n・救助船には、救助時に向かう際は旅客を搭載しないこと\n・救助船には、船長のほか救助を補佐する者１名以上が乗船すること"},{"$f":"B1&\"は、水域\"&B2&\"（\"&B3&\"（水温15℃以上であって母港（\"&D4&\"）から５海里以内の水域））を航行する際、下記１．に記載の安全対策を講じない場合、\"&D5&\"\n\n\"&\"１．別表（救助船_水温③）に掲げる船舶（以下「救助船」という。）を配備する。\n\"&\"遵守事項\n・本船の航路は、救助船の航行区域内とすること\n・救助船は、本船が航行する間、本船から救助の要請があった場合に直ちに救助に向かう位置で待機していること\n・救助船には、救助時に向かう際は旅客を搭載しないこと\n・救助船には、船長のほか救助を補佐する者１名以上が乗船すること\"","v":"本船（船名を入力してください、船舶番号XXX-XXXXX）は、水域6（選択してください（水温15℃以上であって母港（営業船の母港を入力してください（選択してください選択してください））から５海里以内の水域））を航行する際、下記１．に記載の安全対策を講じない場合、事業（海上運送法における人の運送を行う事業や遊漁船業）の用に供しない。\n\n１．別表（救助船_水温③）に掲げる船舶（以下「救助船」という。）を配備する。\n遵守事項\n・本船の航路は、救助船の航行区域内とすること\n・救助船は、本船が航行する間、本船から救助の要請があった場合に直ちに救助に向かう位置で待機していること\n・救助船には、救助時に向かう際は旅客を搭載しないこと\n・救助船には、船長のほか救助を補佐する者１名以上が乗船すること"},{"$f":"B1&\"は、水域\"&B2&\"（\"&B3&\"（水温15℃以上であって母港（\"&D4&\"）から５海里以内の水域））を航行する際、\"&D5","v":"本船（船名を入力してください、船舶番号XXX-XXXXX）は、水域6（選択してください（水温15℃以上であって母港（営業船の母港を入力してください（選択してください選択してください））から５海里以内の水域））を航行する際、事業（海上運送法における人の運送を行う事業や遊漁船業）の用に供しない。"},{"$f":"B1&\"は、水域\"&B2&\"（\"&B3&\"（水温15℃以上であって母港（\"&D4&\"）から５海里以内の水域と水温20℃以上となる水域を除く））を航行する際、別表（救助船_水温③）に掲げる船舶（以下「救助船」という。）を配備する。\n\"&\"\n遵守事項\n・本船の航路は、救助船の航行区域内とすること\n・救助船は、本船が航行する間、本船から救助の要請があった場合に直ちに救助に向かう位置で待機していること\n・救助船には、救助時に向かう際は旅客を搭載しないこと\n・救助船には、船長のほか救助を補佐する者１名以上が乗船すること\"","v":"本船（船名を入力してください、船舶番号XXX-XXXXX）は、水域6（選択してください（水温15℃以上であって母港（営業船の母港を入力してください（選択してください選択してください））から５海里以内の水域と水温20℃以上となる水域を除く））を航行する際、別表（救助船_水温③）に掲げる船舶（以下「救助船」という。）を配備する。\n\n遵守事項\n・本船の航路は、救助船の航行区域内とすること\n・救助船は、本船が航行する間、本船から救助の要請があった場合に直ちに救助に向かう位置で待機していること\n・救助船には、救助時に向かう際は旅客を搭載しないこと\n・救助船には、船長のほか救助を補佐する者１名以上が乗船すること"},{"$f":"B1&\"は、水域\"&B2&\"（\"&B3&\"（水温15℃以上であって母港（\"&D4&\"）から５海里以内の水域を除く））を航行する際、下記１．に記載の安全対策を講じない場合、\"&D5&\"\n\n\"&\"１．別表（伴走船_水温③）に掲げる船舶（以下「伴走船」という。）と共に航行する。\n\"&\"遵守事項\n・３隻以内の伴走船と共に航行すること\n・伴走船の搭載人員は、別表の搭載可能人員を超えることなく、本船の搭載人員分を搭載（救助）できるようにすること\n・伴走船が、出航から帰港まで本船を常に視認でき、かつ、万が一乗客が水中待機した場合であっても早急に救助できる位置を航行すること\n・伴走船には、船長のほか救助を補佐する者１名以上が乗船すること\n　（なお、船員以外の者を補佐人として指定する場合、船長はその者に対し、発航前にその旨を説明し理解を得ること）\"","v":"本船（船名を入力してください、船舶番号XXX-XXXXX）は、水域6（選択してください（水温15℃以上であって母港（営業船の母港を入力してください（選択してください選択してください））から５海里以内の水域を除く））を航行する際、下記１．に記載の安全対策を講じない場合、事業（海上運送法における人の運送を行う事業や遊漁船業）の用に供しない。\n\n１．別表（伴走船_水温③）に掲げる船舶（以下「伴走船」という。）と共に航行する。\n遵守事項\n・３隻以内の伴走船と共に航行すること\n・伴走船の搭載人員は、別表の搭載可能人員を超えることなく、本船の搭載人員分を搭載（救助）できるようにすること\n・伴走船が、出航から帰港まで本船を常に視認でき、かつ、万が一乗客が水中待機した場合であっても早急に救助できる位置を航行すること\n・伴走船には、船長のほか救助を補佐する者１名以上が乗船すること\n　（なお、船員以外の者を補佐人として指定する場合、船長はその者に対し、発航前にその旨を説明し理解を得ること）"},{"$f":"B1&\"は、水域\"&B2&\"（\"&B3&\"（水温15℃以上であって母港（\"&D4&\"）から５海里以内の水域と水温20℃以上となる水域を除く））を航行する際、別表（伴走船_水温③）に掲げる船舶（以下「伴走船」という。）と共に航行する。\n\"&\"\n遵守事項\n・３隻以内の伴走船と共に航行すること\n・伴走船の搭載人員は、別表の搭載可能人員を超えることなく、本船の搭載人員分を搭載（救助）できるようにすること\n・伴走船が、出航から帰港まで本船を常に視認でき、かつ、万が一乗客が水中待機した場合であっても早急に救助できる位置を航行すること\n・伴走船には、船長のほか救助を補佐する者１名以上が乗船すること\n　（なお、船員以外の者を補佐人として指定する場合、船長はその者に対し、発航前にその旨を説明し理解を得ること）\"","v":"本船（船名を入力してください、船舶番号XXX-XXXXX）は、水域6（選択してください（水温15℃以上であって母港（営業船の母港を入力してください（選択してください選択してください））から５海里以内の水域と水温20℃以上となる水域を除く））を航行する際、別表（伴走船_水温③）に掲げる船舶（以下「伴走船」という。）と共に航行する。\n\n遵守事項\n・３隻以内の伴走船と共に航行すること\n・伴走船の搭載人員は、別表の搭載可能人員を超えることなく、本船の搭載人員分を搭載（救助）できるようにすること\n・伴走船が、出航から帰港まで本船を常に視認でき、かつ、万が一乗客が水中待機した場合であっても早急に救助できる位置を航行すること\n・伴走船には、船長のほか救助を補佐する者１名以上が乗船すること\n　（なお、船員以外の者を補佐人として指定する場合、船長はその者に対し、発航前にその旨を説明し理解を得ること）"},{"$f":"B1&\"は、水域\"&B2&\"（\"&B3&\"）を航行する水密全通甲板（又は不沈性及び安定性）を有する船舶である。\"","v":"本船（船名を入力してください、船舶番号XXX-XXXXX）は、水域6（選択してください）を航行する水密全通甲板（又は不沈性及び安定性）を有する船舶である。"},{"$f":"B1&\"は、水域\"&B2&\"（\"&B3&\"）を航行する水密全通甲板（又は不沈性及び安定性）を有する船舶である。\"","v":"本船（船名を入力してください、船舶番号XXX-XXXXX）は、水域6（選択してください）を航行する水密全通甲板（又は不沈性及び安定性）を有する船舶である。"},{"$f":"B1&\"は、水域\"&B2&\"（\"&B3&\"）を航行する水密全通甲板（又は不沈性及び安定性）を有する船舶である。\"","v":"本船（船名を入力してください、船舶番号XXX-XXXXX）は、水域6（選択してください）を航行する水密全通甲板（又は不沈性及び安定性）を有する船舶である。"},{"$f":"B1&\"は、水域\"&B2&\"（\"&B3&\"）を航行する水密全通甲板（又は不沈性及び安定性）を有する船舶である。\"","v":"本船（船名を入力してください、船舶番号XXX-XXXXX）は、水域6（選択してください）を航行する水密全通甲板（又は不沈性及び安定性）を有する船舶である。"},{"$f":"B1&\"は、水域\"&B2&\"（\"&B3&\"）を航行する水密全通甲板（又は不沈性及び安定性）を有する船舶である。\"","v":"本船（船名を入力してください、船舶番号XXX-XXXXX）は、水域6（選択してください）を航行する水密全通甲板（又は不沈性及び安定性）を有する船舶である。"},{"$f":"B1&\"は、水域\"&B2&\"（\"&B3&\"）を航行する水密全通甲板（又は不沈性及び安定性）を有する船舶である。\"","v":"本船（船名を入力してください、船舶番号XXX-XXXXX）は、水域6（選択してください）を航行する水密全通甲板（又は不沈性及び安定性）を有する船舶である。"},{"$f":"B1&\"は、水域\"&B2&\"（\"&B3&\"）を航行する水密全通甲板（又は不沈性及び安定性）を有する船舶である。\"","v":"本船（船名を入力してください、船舶番号XXX-XXXXX）は、水域6（選択してください）を航行する水密全通甲板（又は不沈性及び安定性）を有する船舶である。"}]

{"sheet":"海域リスト","index":8,"n_rows":130,"n_cols":14,"rows_kept":130,"cut":false,"hidden":true,"merged":[[1,2,2,2],[1,3,1,6],[1,7,1,8],[1,9,1,10]]}
[]
[null,null,"海域名","水温",null,null,null,"南北",null,"東西",null,"10℃未満"]
[null,null,null,"10℃未満","15℃未満","20℃未満","20℃以上","北端","南端","東端","西端"]
[null,"XXX","","","","","","","","",""]
[null,1,"サロマ湖","11/6~5/11","-","-","-","-","-","-","-",{"$f":"IFERROR(LEFT(D5,FIND(\"~\",D5)-1),\"\")","v":"11/6"},{"$f":"IFERROR(RIGHT(D5,LEN(D5)-FIND(\"~\",D5)),\"\")","v":"5/11"}]
[null,2,"屈斜路湖","11/15~5/16","-","-","-","-","-","-","-",{"$f":"IFERROR(LEFT(D6,FIND(\"~\",D6)-1),\"\")","v":"11/15"},{"$f":"IFERROR(RIGHT(D6,LEN(D6)-FIND(\"~\",D6)),\"\")","v":"5/16"}]
[null,3,"支笏湖","11/19~5/23","-","-","-","-","-","-","-","11/19","5/23"]
[null,4,"猪苗代湖","11/29~4/28","-","-","-","-","-","-","-","11/29","4/28"]
[null,5,"霞ヶ浦","12/10~3/19","-","-","-","-","-","-","-","12/10","3/19"]
[null,6,"中海","12/13~3/20","-","-","-","-","-","-","-","12/13","3/20"]
[null,7,"宍道湖","12/13~3/19","-","-","-","-","-","-","-","12/13","3/19"]
[null,8,"琵琶湖","1/4~3/24","-","-","-","-","-","-","-","1/4","3/24"]
[null,101,"宗谷地方オホーツク海沿岸","10/28~6/15","10/2~7/16","4/1~3/31","なし","北緯45.75度","北緯45.5度","東経142.25度","東経142度","10/28","6/15","通年は4/1~3/31"]
[null,102,"紋別地方沿岸","10/28~6/15","10/1~7/19","4/1~3/31","なし","北緯44.75度","北緯44.5度","東経143.25度","東経143度","10/28","6/15"]
[null,103,"網走地方沿岸","10/30~6/18","9/28~7/22","4/1~3/31","なし","北緯44.25度","北緯44度","東経144.25度","東経144度","10/30","6/18"]
[null,104,"知床岬の東","11/4~6/25","9/28~7/31","4/1~3/31","なし","北緯44.5度","北緯44.25度","東経145.5度","東経145.25度","11/4","6/25"]
[null,105,"根室海峡","11/13~6/21","10/7~7/29","4/1~3/31","なし","北緯44度","北緯43.75度","東経145.25度","東経145度","11/13","6/21"]
[null,106,"宗谷地方日本海沿岸","11/23~5/31","10/20~7/2","9/13~8/9","左記期間以外","北緯45.25度","北緯45度","東経140.75度","東経140.5度","11/23","5/31"]
[null,107,"留萌地方沿岸北部","12/1~5/24","10/25~6/25","9/21~7/31","左記期間以外","北緯44.75度","北緯44.5度","東経141度","東経140.75度","12/1","5/24"]
[null,108,"留萌地方沿岸南部","12/4~5/19","10/28~6/20","9/23~7/27","左記期間以外","北緯44.5度","北緯44.25度","東経141度","東経140.75度","12/4","5/19"]
[null,109,"石狩地方沿岸","12/7~5/15","10/29~6/17","9/25~7/24","左記期間以外","北緯43.5度","北緯43.25度","東経141.25度","東経141度","12/7","5/15"]
[null,110,"後志北部沿岸","12/9~5/15","10/31~6/17","9/26~7/24","左記期間以外","北緯43.5度","北緯43.25度","東経140.25度","東経140度","12/9","5/15"]
[null,111,"後志西部沿岸","12/15~5/11","11/4~6/14","9/29~7/22","左記期間以外","北緯42.75度","北緯42.5度","東経139.75度","東経139.5度","12/15","5/11"]
[null,112,"檜山地方沿岸","12/21~5/8","11/8~6/10","10/4~7/17","左記期間以外","北緯42度","北緯41.75度","東経139.25度","東経139度","12/21","5/8"]
[null,113,"津軽海峡の西側","1/10~4/29","11/18~6/5","10/10~7/11","左記期間以外","北緯41.5度","北緯41.25度","東経139.25度","東経139度","1/10","4/29"]
[null,114,"青森県日本海沿岸","1/24~4/22","12/3~5/31","10/18~7/4","左記期間以外","北緯40.75度","北緯40.5度","東経139.75度","東経139.5度","1/24","4/22"]
[null,115,"津軽海峡","1/14~5/6","11/24~6/13","10/9~7/19","左記期間以外","北緯41.25度","北緯41度","東経140.5度","東経140.25度","1/14","5/6"]
[null,116,"津軽海峡の東側","12/22~5/23","11/6~6/26","9/23~8/1","左記期間以外","北緯42.25度","北緯42度","東経141度","東経140.75度","12/22","5/23"]
[null,117,"青森県太平洋沿岸","1/10~5/15","11/21~6/24","9/30~7/30","左記期間以外","北緯41度","北緯40.75度","東経141.5度","東経141.25度","1/10","5/15"]
[null,118,"内浦湾","12/11~5/21","10/30~6/19","9/23~7/27","左記期間以外","北緯42.5度","北緯42.25度","東経140.5度","東経140.25度","12/11","5/21"]
[null,119,"胆振中・東部沿岸","12/13~5/27","10/29~6/27","9/17~8/4","左記期間以外","北緯42.5度","北緯42.25度","東経141.25度","東経141度","12/13","5/27"]
[null,120,"日高地方南西沿岸","12/12~5/31","10/31~7/5","9/17~8/13","左記期間以外","北緯42.25度","北緯42度","東経142.25度","東経142度","12/12","5/31"]
[null,121,"十勝地方沿岸","11/24~6/8","10/10~7/12","4/1~3/31","なし","北緯41.75度","北緯41.5度","東経143.5度","東経143.25度","11/24","6/8"]
[null,122,"釧路地方沿岸","11/16~6/16","10/4~7/21","4/1~3/31","なし","北緯43度","北緯42.75度","東経144.25度","東経144度","11/16","6/16"]
[null,123,"根室地方太平洋沿岸","11/12~6/26","9/28~8/3","4/1~3/31","なし","北緯43.25度","北緯43度","東経145.5度","東経145.25度","11/12","6/26"]
[null,124,"国後島南東沿岸","11/12~6/29","10/1~8/7","4/1~3/31","なし","北緯44度","北緯43.75度","東経145.75度","東経145.5度","11/12","6/29"]
[null,125,"色丹島の南東側","11/6~7/4","9/18~8/19","4/1~3/31","なし","北緯43.5度","北緯43.25度","東経146.5度","東経146.25度","11/6","7/4"]
[null,126,"択捉島オホーツク海沿岸","10/31~7/7","9/13~8/30","4/1~3/31","なし","北緯45度","北緯44.75度","東経146.75度","東経146.5度","10/31","7/7"]
[null,127,"択捉島太平洋沿岸","10/26~7/16","4/1~3/31","なし","なし","北緯44.25度","北緯44度","東経147度","東経146.75度","10/26","7/16"]
[null,128,"ウルップ島沿岸","10/4~7/31","4/1~3/31","なし","なし","北緯45.75度","北緯45.5度","東経149.25度","東経149度","10/4","7/31"]
[null,129,"ウルップ水道","9/17~8/19","4/1~3/31","なし","なし","北緯46.5度","北緯46.25度","東経150.5度","東経150.25度","9/17","8/19"]
[null,130,"陸奥湾","1/7~5/10","11/19~6/11","10/8~7/20","左記期間以外","北緯41度","北緯40.75度","東経141度","東経140.75度","1/7","5/10"]
[null,131,"秋田県沿岸","2/3~4/14","12/10~5/25","10/23~6/26","左記期間以外","北緯39.5度","北緯39.25度","東経139.5度","東経139.25度","2/3","4/14"]
[null,132,"岩手県北部沿岸","1/13~5/14","11/19~6/20","9/25~7/28","左記期間以外","北緯40.25度","北緯40度","東経142度","東経141.75度","1/13","5/14"]
[null,133,"岩手県南部沿岸","1/20~5/2","11/27~6/11","10/1~7/22","左記期間以外","北緯39.25度","北緯39度","東経142度","東経141.75度","1/20","5/2"]
[null,134,"山形県沿岸","2/13~4/7","12/14~5/21","10/27~6/20","左記期間以外","北緯39度","北緯38.75度","東経139.5度","東経139.25度","2/13","4/7"]
[null,135,"宮城県沿岸","2/1~4/14","12/5~5/29","10/9~7/11","左記期間以外","北緯38.25度","北緯38度","東経141度","東経140.75度","2/1","4/14"]
[null,136,"福島県沿岸","なし","12/17~5/22","10/14~7/5","左記期間以外","北緯37.25度","北緯37度","東経141.25度","東経141度","",""]
[null,137,"茨城県北部沿岸","なし","1/5~4/24","10/25~6/25","左記期間以外","北緯36.5度","北緯36.25度","東経140.75度","東経140.5度","",""]
[null,138,"茨城県南部沿岸","なし","1/24~4/7","11/8~6/14","左記期間以外","北緯36.25度","北緯36度","東経140.75度","東経140.5度","",""]
[null,303,"千葉県北東部沿岸","なし","2/23~3/3","11/25~5/29","左記期間以外","北緯35.5度","北緯35.25度","東経140.5度","東経140.25度","",""]
[null,304,"千葉県南部沿岸","なし","なし","12/8~5/19","左記期間以外","北緯35度","北緯34.75度","東経140度","東経139.75度","",""]
[null,306,"相模湾","なし","なし","11/27~5/24","左記期間以外","北緯35.25度","北緯35度","東経139.25度","東経139度","",""]
[null,307,"伊豆諸島北部沿岸","なし","なし","12/7~5/16","左記期間以外","北緯34.5度","北緯34.25度","東経139度","東経138.75度","",""]
[null,308,"三宅島沿岸","なし","なし","12/25~4/27","左記期間以外","北緯33.75度","北緯33.5度","東経139.5度","東経139.25度","",""]
[null,309,"八丈島沿岸","なし","なし","1/12~4/18","左記期間以外","北緯33.25度","北緯33度","東経139.5度","東経139.25度","",""]
[null,310,"駿河湾","なし","なし","11/30~5/19","左記期間以外","北緯34.5度","北緯34.25度","東経138.5度","東経138.25度","",""]
[null,311,"遠州灘","なし","なし","12/1~5/20","左記期間以外","北緯34.5度","北緯34.25度","東経137.25度","東経137度","",""]
[null,313,"熊野灘","なし","なし","12/5~5/15","左記期間以外","北緯34度","北緯33.75度","東経136.25度","東経136度","",""]
[null,314,"下越沿岸","2/19~4/1","12/16~5/18","10/29~6/17","左記期間以外","北緯38度","北緯37.75度","東経139度","東経138.75度","2/19","4/1"]
[null,315,"佐渡沿岸","3/3~3/28","12/17~5/19","10/29~6/20","左記期間以外","北緯38度","北緯37.75度","東経138.25度","東経138度","3/3","3/28"]
[null,316,"中越沿岸","なし","12/20~5/17","11/1~6/17","左記期間以外","北緯37.75度","北緯37.5度","東経138.25度","東経138度","",""]
[null,317,"上越沿岸","なし","12/22~5/16","11/2~6/15","左記期間以外","北緯37.25度","北緯37度","東経137.75度","東経137.5度","",""]
[null,318,"富山湾","なし","12/23~5/14","11/3~6/14","左記期間以外","北緯37.25度","北緯37度","東経137.25度","東経137度","",""]
[null,319,"能登北部沿岸","なし","12/21~5/15","11/1~6/17","左記期間以外","北緯37.5度","北緯37.25度","東経136.5度","東経136.25度","",""]
[null,320,"能登南部・加賀沿岸","なし","12/26~5/10","11/4~6/13","左記期間以外","北緯36.75度","北緯36.5度","東経136.25度","東経136度","",""]
[null,321,"福井県沿岸","なし","12/29~5/3","11/8~6/10","左記期間以外","北緯35.75度","北緯35.5度","東経135.75度","東経135.5度","",""]
[null,401,"小笠原沿岸","なし","なし","なし","通年","北緯28.25度","北緯28度","東経142.25度","東経142度"]
[null,501,"京都府沿岸","なし","12/30~5/2","11/7~6/10","左記期間以外","北緯36度","北緯35.75度","東経135.25度","東経135度","",""]
[null,502,"兵庫県北部沿岸","なし","12/31~5/1","11/7~6/10","左記期間以外","北緯35.75度","北緯35.5度","東経134.5度","東経134.25度","",""]
[null,503,"鳥取県東部沿岸","なし","1/1~4/30","11/9~6/9","左記期間以外","北緯35.75度","北緯35.5度","東経134度","東経133.75度",{"$f":"IFERROR(LEFT(D71,FIND(\"~\",D71)-1),\"\")","v":""},{"$f":"IFERROR(RIGHT(D71,LEN(D71)-FIND(\"~\",D71)),\"\")","v":""}]
[null,504,"鳥取県西部沿岸","なし","1/3~4/29","11/11~6/9","左記期間以外","北緯35.75度","北緯35.5度","東経133.5度","東経133.25度","",""]
[null,505,"隠岐沿岸","なし","1/3~4/30","11/8~6/12","左記期間以外","北緯36.25度","北緯36度","東経133度","東経132.75度","",""]
[null,506,"島根県東部沿岸","なし","1/9~4/25","11/15~6/8","左記期間以外","北緯35.5度","北緯35.25度","東経132.75度","東経132.5度","",""]
[null,507,"島根県西部沿岸","なし","1/16~4/19","11/20~6/6","左記期間以外","北緯35度","北緯34.75度","東経131.75度","東経131.5度","",""]
[null,508,"安芸灘・伊予灘","なし","12/31~5/1","11/18~6/17","左記期間以外","北緯33.4度","北緯33.3度","東経131.7度","東経131.6度","",""]
[null,509,"備後灘・燧灘","なし","12/16~4/22","11/13~6/1","左記期間以外","北緯34度","北緯33.9度","東経133.2度","東経133.1度","",""]
[null,510,"播磨灘・備讃瀬戸※","2/9~2/26","12/16~5/2","11/12~6/6","左記期間以外","北緯34.5度","北緯34.4度","東経134度","東経133.9度","2/9","2/26"]
[null,511,"紀伊水道","なし","なし","11/30~5/25","左記期間以外","北緯34度","北緯33.75度","東経134.75度","東経134.5度","",""]
[null,512,"紀伊水道沖","なし","なし","12/15~5/12","左記期間以外","北緯33.75度","北緯33.5度","東経134.5度","東経134.25度","",""]
[null,513,"和歌山県南部沿岸（紀伊水道側）","なし","なし","12/26~4/28","左記期間以外","北緯33.5度","北緯33.25度","東経135.5度","東経135.25度","",""]
[null,514,"和歌山県南部沿岸（熊野灘側）","なし","なし","12/19~5/3","左記期間以外","北緯33.5度","北緯33.25度","東経136度","東経135.75度","",""]
[null,515,"高知県東部沿岸","なし","なし","12/26~4/27","左記期間以外","北緯33.25度","北緯33度","東経134.25度","東経134度","",""]
[null,516,"土佐湾","なし","なし","12/21~5/1","左記期間以外","北緯33度","北緯32.75度","東経133.25度","東経133度","",""]
[null,517,"高知県西部沿岸","なし","なし","1/10~4/13","左記期間以外","北緯32.75度","北緯32.5度","東経132.75度","東経132.5度","",""]
[null,518,"豊後水道南部","なし","なし","12/19~5/8","左記期間以外","北緯33度","北緯32.75度","東経132度","東経131.75度","",""]
[null,519,"豊後水道北部","なし","なし","12/1~5/24","左記期間以外","北緯33.25度","北緯33度","東経132度","東経131.75度","",""]
[null,520,"大阪湾","なし","12/16~4/30","11/11~6/5","左記期間以外","北緯34.4度","北緯34.3度","東経135度","東経134.9度","",""]
[null,521,"隠岐沿岸北部","なし","12/26~5/10","11/4~6/13","左記期間以外","北緯36.75度","北緯36.5度","東経133度","東経132.75度"]
[null,601,"山口県沿岸北部","なし","1/22~4/16","11/22~6/5","左記期間以外","北緯34.75度","北緯34.5度","東経131度","東経130.75度","",""]
[null,602,"玄界灘・響灘","なし","1/25~4/9","11/22~6/4","左記期間以外","北緯33.75度","北緯33.5度","東経130.25度","東経130度","",""]
[null,603,"壱岐水道","なし","1/31~3/31","11/25~6/3","左記期間以外","北緯33.75度","北緯33.5度","東経129.5度","東経129.25度","",""]
[null,604,"対馬沿岸南部","なし","2/13~3/28","11/28~6/3","左記期間以外","北緯34.25度","北緯34度","東経129度","東経128.75度","",""]
[null,605,"対馬沿岸北部","なし","1/30~4/9","11/21~6/8","左記期間以外","北緯34.5度","北緯34.25度","東経129.25度","東経129度","",""]
[null,606,"五島列島沿岸西部","なし","なし","12/6~5/27","左記期間以外","北緯32.75度","北緯32.5度","東経128.5度","東経128.25度","",""]
[null,607,"男女群島沿岸","なし","なし","12/19~5/8","左記期間以外","北緯32度","北緯31.75度","東経128.5度","東経128.25度","",""]
[null,608,"五島灘","なし","なし","12/3~5/25","左記期間以外","北緯32.5度","北緯32.25度","東経128.75度","東経128.5度","",""]
[null,609,"天草灘・甑島沿岸北部","なし","なし","12/10~5/13","左記期間以外","北緯32度","北緯31.75度","東経129.75度","東経129.5度","",""]
[null,610,"甑島沿岸南部","なし","なし","12/24~4/28","左記期間以外","北緯31.5度","北緯31.25度","東経129.75度","東経129.5度","",""]
[null,611,"黒島沿岸","なし","なし","1/22~3/29","左記期間以外","北緯30.75度","北緯30.5度","東経130度","東経129.75度","",""]
[null,612,"大隅海峡","なし","なし","1/10~4/4","左記期間以外","北緯31度","北緯30.75度","東経130.5度","東経130.25度","",""]
[null,613,"種子島・屋久島沿岸","なし","なし","1/30~3/8","左記期間以外","北緯30.75度","北緯30.5度","東経130.5度","東経130.25度","",""]
[null,614,"屋久島沿岸南西部","なし","なし","なし","通年","北緯30.5度","北緯30.25度","東経130度","東経129.75度","",""]
[null,615,"トカラ列島沿岸北部","なし","なし","なし","通年","北緯29.75度","北緯29.5度","東経129.5度","東経129.25度","",""]
[null,616,"トカラ列島沿岸南部","なし","なし","なし","通年","北緯29度","北緯28.75度","東経129度","東経128.75度","",""]
[null,617,"奄美群島沿岸北西部","なし","なし","なし","通年","北緯28.25度","北緯28度","東経129.25度","東経129度","",""]
[null,618,"奄美群島沿岸南西部","なし","なし","なし","通年","北緯27.25度","北緯27度","東経128.5度","東経128.25度","",""]
[null,619,"奄美群島沿岸南東部","なし","なし","なし","通年","北緯27度","北緯26.75度","東経128.5度","東経128.25度","",""]
[null,620,"奄美群島沿岸北東部","なし","なし","なし","通年","北緯28度","北緯27.75度","東経129.5度","東経129.25度","",""]
[null,621,"日向灘南部","なし","なし","1/10~4/8","左記期間以外","北緯31.5度","北緯31.25度","東経131.25度","東経131度","",""]
[null,622,"日向灘北部","なし","なし","12/30~4/25","左記期間以外","北緯32.25度","北緯32度","東経131.75度","東経131.5度","",""]
[null,623,"周防灘","なし","12/14~4/29","11/9~6/4","左記期間以外","北緯33.9度","北緯33.8度","東経131.1度","東経131度","",""]
[null,624,"対馬沿岸東部","なし","1/22~4/16","11/22~6/5","左記期間以外","北緯35度","北緯34.75度","東経129.75度","東経129.5度"]
[null,625,"対馬沿岸北東部","なし","1/9~4/25","11/15~6/8","左記期間以外","北緯35.25度","北緯35度","東経129.75度","東経129.5度"]
[null,626,"対馬沿岸北西部","なし","1/3~4/30","11/8~6/12","左記期間以外","北緯35度","北緯34.75度","東経129.25度","東経129度"]
[null,627,"対馬沿岸西部","なし","1/9~4/25","11/15~6/8","左記期間以外","北緯34.5度","北緯34.25度","東経129度","東経128.75度"]
[null,701,"南大東島南","なし","なし","なし","通年","北緯25.75度","北緯25.5度","東経131.25度","東経131度","",""]
[null,702,"沖縄本島東","なし","なし","なし","通年","北緯26.5度","北緯26.25度","東経128.25度","東経128度","",""]
[null,703,"沖縄本島北","なし","なし","なし","通年","北緯27度","北緯26.75度","東経127.75度","東経127.5度","",""]
[null,704,"沖縄本島南","なし","なし","なし","通年","北緯26度","北緯25.75度","東経127.75度","東経127.5度","",""]
[null,705,"久米島南","なし","なし","なし","通年","北緯26.25度","北緯26度","東経127度","東経126.75度","",""]
[null,706,"宮古島南","なし","なし","なし","通年","北緯24.75度","北緯24.5度","東経125.5度","東経125.25度","",""]
[null,707,"石垣島北","なし","なし","なし","通年","北緯24.75度","北緯24.5度","東経124.25度","東経124度","",""]
[null,708,"石垣島南","なし","なし","なし","通年","北緯24.25度","北緯24度","東経124.25度","東経124度",{"$f":"IFERROR(LEFT(D124,FIND(\"~\",D124)-1),\"\")","v":""},{"$f":"IFERROR(RIGHT(D124,LEN(D124)-FIND(\"~\",D124)),\"\")","v":""}]
[null,709,"与那国島南","なし","なし","なし","通年","北緯24.5度","北緯24.25度","東経123.25度","東経123度","",""]
[null,901,"第１号平水（東京湾）","なし","-","-","-","-","-","-","-"]
[null,902,"第３号平水（伊勢湾・三河湾）","なし","-","-","-","-","-","-","-"]
[null,903,"第22号平水（有明海）","なし","-","-","-","-","-","-","-"]
[null,904,"第24号平水（佐世保湾）","なし","-","-","-","-","-","-","-"]
[null,905,"第13号平水（鹿児島湾）","なし","-","-","-","-","-","-","-",{"$f":"IFERROR(LEFT(D121,FIND(\"~\",D121)-1),\"\")","v":""},{"$f":"IFERROR(RIGHT(D121,LEN(D121)-FIND(\"~\",D121)),\"\")","v":""}]

{"sheet":"市区町村","index":9,"n_rows":1893,"n_cols":9,"rows_kept":1893,"cut":false,"hidden":true,"merged":[]}
["都道府県",null,"都道府県","市区町村","都道府県（ﾌﾘｶﾞﾅ）","市区町村（ﾌﾘｶﾞﾅ）"]
["選択してください",null,"北海道","札幌市中央区","ﾎｯｶｲﾄﾞｳ","ｻｯﾎﾟﾛｼﾁｭｳｵｳｸ",{"$f":"IFERROR(INDIRECT(ADDRESS(MATCH(水温①!E$72,C$2:C$1893,0)+ROW()-1,4)&\":D\"&MATCH(水温①!E$72,C$2:C$1893,0)+COUNTIF(C2:C1893,水温①!E$72)),\"選択してください\")","v":"選択してください"},{"$f":"IFERROR(INDIRECT(ADDRESS(MATCH(水温②!E$72,C$2:C$1893,0)+ROW()-1,4)&\":D\"&MATCH(水温②!E$72,C$2:C$1893,0)+COUNTIF(C2:C1893,水温②!E$72)),\"選択してください\")","v":"選択してください"},{"$f":"IFERROR(INDIRECT(ADDRESS(MATCH(水温③!E$72,C$2:C$1893,0)+ROW()-1,4)&\":D\"&MATCH(水温③!E$72,C$2:C$1893,0)+COUNTIF(C2:C1893,水温③!E$72)),\"選択してください\")","v":"選択してください"}]
["北海道",null,"北海道","札幌市北区","ﾎｯｶｲﾄﾞｳ","ｻｯﾎﾟﾛｼｷﾀｸ"]
["青森県",null,"北海道","札幌市東区","ﾎｯｶｲﾄﾞｳ","ｻｯﾎﾟﾛｼﾋｶﾞｼｸ"]
["岩手県",null,"北海道","札幌市白石区","ﾎｯｶｲﾄﾞｳ","ｻｯﾎﾟﾛｼｼﾛｲｼｸ"]
["宮城県",null,"北海道","札幌市豊平区","ﾎｯｶｲﾄﾞｳ","ｻｯﾎﾟﾛｼﾄﾖﾋﾗｸ"]
["秋田県",null,"北海道","札幌市南区","ﾎｯｶｲﾄﾞｳ","ｻｯﾎﾟﾛｼﾐﾅﾐｸ"]
["山形県",null,"北海道","札幌市西区","ﾎｯｶｲﾄﾞｳ","ｻｯﾎﾟﾛｼﾆｼｸ"]
["福島県",null,"北海道","札幌市厚別区","ﾎｯｶｲﾄﾞｳ","ｻｯﾎﾟﾛｼｱﾂﾍﾞﾂｸ"]
["茨城県",null,"北海道","札幌市手稲区","ﾎｯｶｲﾄﾞｳ","ｻｯﾎﾟﾛｼﾃｲﾈｸ"]
["栃木県",null,"北海道","札幌市清田区","ﾎｯｶｲﾄﾞｳ","ｻｯﾎﾟﾛｼｷﾖﾀｸ"]
["群馬県",null,"北海道","函館市","ﾎｯｶｲﾄﾞｳ","ﾊｺﾀﾞﾃｼ"]
["埼玉県",null,"北海道","小樽市","ﾎｯｶｲﾄﾞｳ","ｵﾀﾙｼ"]
["千葉県",null,"北海道","旭川市","ﾎｯｶｲﾄﾞｳ","ｱｻﾋｶﾜｼ"]
["東京都",null,"北海道","室蘭市","ﾎｯｶｲﾄﾞｳ","ﾑﾛﾗﾝｼ"]
["神奈川県",null,"北海道","釧路市","ﾎｯｶｲﾄﾞｳ","ｸｼﾛｼ"]
["新潟県",null,"北海道","帯広市","ﾎｯｶｲﾄﾞｳ","ｵﾋﾞﾋﾛｼ"]
["富山県",null,"北海道","北見市","ﾎｯｶｲﾄﾞｳ","ｷﾀﾐｼ"]
["石川県",null,"北海道","夕張市","ﾎｯｶｲﾄﾞｳ","ﾕｳﾊﾞﾘｼ"]
["福井県",null,"北海道","岩見沢市","ﾎｯｶｲﾄﾞｳ","ｲﾜﾐｻﾞﾜｼ"]
["山梨県",null,"北海道","網走市","ﾎｯｶｲﾄﾞｳ","ｱﾊﾞｼﾘｼ"]
["長野県",null,"北海道","留萌市","ﾎｯｶｲﾄﾞｳ","ﾙﾓｲｼ"]
["岐阜県",null,"北海道","苫小牧市","ﾎｯｶｲﾄﾞｳ","ﾄﾏｺﾏｲｼ"]
["静岡県",null,"北海道","稚内市","ﾎｯｶｲﾄﾞｳ","ﾜｯｶﾅｲｼ"]
["愛知県",null,"北海道","美唄市","ﾎｯｶｲﾄﾞｳ","ﾋﾞﾊﾞｲｼ"]
["三重県",null,"北海道","芦別市","ﾎｯｶｲﾄﾞｳ","ｱｼﾍﾞﾂｼ"]
["滋賀県",null,"北海道","江別市","ﾎｯｶｲﾄﾞｳ","ｴﾍﾞﾂｼ"]
["京都府",null,"北海道","赤平市","ﾎｯｶｲﾄﾞｳ","ｱｶﾋﾞﾗｼ"]
["大阪府",null,"北海道","紋別市","ﾎｯｶｲﾄﾞｳ","ﾓﾝﾍﾞﾂｼ"]
["兵庫県",null,"北海道","士別市","ﾎｯｶｲﾄﾞｳ","ｼﾍﾞﾂｼ"]
["奈良県",null,"北海道","名寄市","ﾎｯｶｲﾄﾞｳ","ﾅﾖﾛｼ"]
["和歌山県",null,"北海道","三笠市","ﾎｯｶｲﾄﾞｳ","ﾐｶｻｼ"]
["鳥取県",null,"北海道","根室市","ﾎｯｶｲﾄﾞｳ","ﾈﾑﾛｼ"]
["島根県",null,"北海道","千歳市","ﾎｯｶｲﾄﾞｳ","ﾁﾄｾｼ"]
["岡山県",null,"北海道","滝川市","ﾎｯｶｲﾄﾞｳ","ﾀｷｶﾜｼ"]
["広島県",null,"北海道","砂川市","ﾎｯｶｲﾄﾞｳ","ｽﾅｶﾞﾜｼ"]
["山口県",null,"北海道","歌志内市","ﾎｯｶｲﾄﾞｳ","ｳﾀｼﾅｲｼ"]
["徳島県",null,"北海道","深川市","ﾎｯｶｲﾄﾞｳ","ﾌｶｶﾞﾜｼ"]
["香川県",null,"北海道","富良野市","ﾎｯｶｲﾄﾞｳ","ﾌﾗﾉｼ"]
["愛媛県",null,"北海道","登別市","ﾎｯｶｲﾄﾞｳ","ﾉﾎﾞﾘﾍﾞﾂｼ"]
["高知県",null,"北海道","恵庭市","ﾎｯｶｲﾄﾞｳ","ｴﾆﾜｼ"]
["福岡県",null,"北海道","伊達市","ﾎｯｶｲﾄﾞｳ","ﾀﾞﾃｼ"]
["佐賀県",null,"北海道","北広島市","ﾎｯｶｲﾄﾞｳ","ｷﾀﾋﾛｼﾏｼ"]
["長崎県",null,"北海道","石狩市","ﾎｯｶｲﾄﾞｳ","ｲｼｶﾘｼ"]
["熊本県",null,"北海道","北斗市","ﾎｯｶｲﾄﾞｳ","ﾎｸﾄｼ"]
["大分県",null,"北海道","石狩郡当別町","ﾎｯｶｲﾄﾞｳ","ｲｼｶﾘｸﾞﾝﾄｳﾍﾞﾂﾁｮｳ"]
["宮崎県",null,"北海道","石狩郡新篠津村","ﾎｯｶｲﾄﾞｳ","ｲｼｶﾘｸﾞﾝｼﾝｼﾉﾂﾑﾗ"]
["鹿児島県",null,"北海道","松前郡松前町","ﾎｯｶｲﾄﾞｳ","ﾏﾂﾏｴｸﾞﾝﾏﾂﾏｴﾁｮｳ"]
["沖縄県",null,"北海道","松前郡福島町","ﾎｯｶｲﾄﾞｳ","ﾏﾂﾏｴｸﾞﾝﾌｸｼﾏﾁｮｳ"]
[null,null,"北海道","上磯郡知内町","ﾎｯｶｲﾄﾞｳ","ｶﾐｲｿｸﾞﾝｼﾘｳﾁﾁｮｳ"]
[null,null,"北海道","上磯郡木古内町","ﾎｯｶｲﾄﾞｳ","ｶﾐｲｿｸﾞﾝｷｺﾅｲﾁｮｳ"]
[null,null,"北海道","亀田郡七飯町","ﾎｯｶｲﾄﾞｳ","ｶﾒﾀﾞｸﾞﾝﾅﾅｴﾁｮｳ"]
[null,null,"北海道","茅部郡鹿部町","ﾎｯｶｲﾄﾞｳ","ｶﾔﾍﾞｸﾞﾝｼｶﾍﾞﾁｮｳ"]
[null,null,"北海道","茅部郡森町","ﾎｯｶｲﾄﾞｳ","ｶﾔﾍﾞｸﾞﾝﾓﾘﾏﾁ"]
[null,null,"北海道","二海郡八雲町","ﾎｯｶｲﾄﾞｳ","ﾌﾀﾐｸﾞﾝﾔｸﾓﾁｮｳ"]
[null,null,"北海道","山越郡長万部町","ﾎｯｶｲﾄﾞｳ","ﾔﾏｺｼｸﾞﾝｵｼｬﾏﾝﾍﾞﾁｮｳ"]
[null,null,"北海道","檜山郡江差町","ﾎｯｶｲﾄﾞｳ","ﾋﾔﾏｸﾞﾝｴｻｼﾁｮｳ"]
[null,null,"北海道","檜山郡上ノ国町","ﾎｯｶｲﾄﾞｳ","ﾋﾔﾏｸﾞﾝｶﾐﾉｸﾆﾁｮｳ"]
[null,null,"北海道","檜山郡厚沢部町","ﾎｯｶｲﾄﾞｳ","ﾋﾔﾏｸﾞﾝｱｯｻﾌﾞﾁｮｳ"]
[null,null,"北海道","爾志郡乙部町","ﾎｯｶｲﾄﾞｳ","ﾆｼｸﾞﾝｵﾄﾍﾞﾁｮｳ"]
[null,null,"北海道","奥尻郡奥尻町","ﾎｯｶｲﾄﾞｳ","ｵｸｼﾘｸﾞﾝｵｸｼﾘﾁｮｳ"]
[null,null,"北海道","瀬棚郡今金町","ﾎｯｶｲﾄﾞｳ","ｾﾀﾅｸﾞﾝｲﾏｶﾈﾁｮｳ"]
[null,null,"北海道","久遠郡せたな町","ﾎｯｶｲﾄﾞｳ","ｸﾄﾞｳｸﾞﾝｾﾀﾅﾁｮｳ"]
[null,null,"北海道","島牧郡島牧村","ﾎｯｶｲﾄﾞｳ","ｼﾏﾏｷｸﾞﾝｼﾏﾏｷﾑﾗ"]
[null,null,"北海道","寿都郡寿都町","ﾎｯｶｲﾄﾞｳ","ｽｯﾂｸﾞﾝｽｯﾂﾁｮｳ"]
[null,null,"北海道","寿都郡黒松内町","ﾎｯｶｲﾄﾞｳ","ｽｯﾂｸﾞﾝｸﾛﾏﾂﾅｲﾁｮｳ"]
[null,null,"北海道","磯谷郡蘭越町","ﾎｯｶｲﾄﾞｳ","ｲｿﾔｸﾞﾝﾗﾝｺｼﾁｮｳ"]
[null,null,"北海道","虻田郡ニセコ町","ﾎｯｶｲﾄﾞｳ","ｱﾌﾞﾀｸﾞﾝﾆｾｺﾁｮｳ"]
[null,null,"北海道","虻田郡真狩村","ﾎｯｶｲﾄﾞｳ","ｱﾌﾞﾀｸﾞﾝﾏｯｶﾘﾑﾗ"]
[null,null,"北海道","虻田郡留寿都村","ﾎｯｶｲﾄﾞｳ","ｱﾌﾞﾀｸﾞﾝﾙｽﾂﾑﾗ"]
[null,null,"北海道","虻田郡喜茂別町","ﾎｯｶｲﾄﾞｳ","ｱﾌﾞﾀｸﾞﾝｷﾓﾍﾞﾂﾁｮｳ"]
[null,null,"北海道","虻田郡京極町","ﾎｯｶｲﾄﾞｳ","ｱﾌﾞﾀｸﾞﾝｷｮｳｺﾞｸﾁｮｳ"]
[null,null,"北海道","虻田郡倶知安町","ﾎｯｶｲﾄﾞｳ","ｱﾌﾞﾀｸﾞﾝｸｯﾁｬﾝﾁｮｳ"]
[null,null,"北海道","岩内郡共和町","ﾎｯｶｲﾄﾞｳ","ｲﾜﾅｲｸﾞﾝｷｮｳﾜﾁｮｳ"]
[null,null,"北海道","岩内郡岩内町","ﾎｯｶｲﾄﾞｳ","ｲﾜﾅｲｸﾞﾝｲﾜﾅｲﾁｮｳ"]
[null,null,"北海道","古宇郡泊村","ﾎｯｶｲﾄﾞｳ","ﾌﾙｳｸﾞﾝﾄﾏﾘﾑﾗ"]
[null,null,"北海道","古宇郡神恵内村","ﾎｯｶｲﾄﾞｳ","ﾌﾙｳｸﾞﾝｶﾓｴﾅｲﾑﾗ"]
[null,null,"北海道","積丹郡積丹町","ﾎｯｶｲﾄﾞｳ","ｼｬｺﾀﾝｸﾞﾝｼｬｺﾀﾝﾁｮｳ"]
[null,null,"北海道","古平郡古平町","ﾎｯｶｲﾄﾞｳ","ﾌﾙﾋﾞﾗｸﾞﾝﾌﾙﾋﾞﾗﾁｮｳ"]
[null,null,"北海道","余市郡仁木町","ﾎｯｶｲﾄﾞｳ","ﾖｲﾁｸﾞﾝﾆｷﾁｮｳ"]
[null,null,"北海道","余市郡余市町","ﾎｯｶｲﾄﾞｳ","ﾖｲﾁｸﾞﾝﾖｲﾁﾁｮｳ"]
[null,null,"北海道","余市郡赤井川村","ﾎｯｶｲﾄﾞｳ","ﾖｲﾁｸﾞﾝｱｶｲｶﾞﾜﾑﾗ"]
[null,null,"北海道","空知郡南幌町","ﾎｯｶｲﾄﾞｳ","ｿﾗﾁｸﾞﾝﾅﾝﾎﾟﾛﾁｮｳ"]
[null,null,"北海道","空知郡奈井江町","ﾎｯｶｲﾄﾞｳ","ｿﾗﾁｸﾞﾝﾅｲｴﾁｮｳ"]
[null,null,"北海道","空知郡上砂川町","ﾎｯｶｲﾄﾞｳ","ｿﾗﾁｸﾞﾝｶﾐｽﾅｶﾞﾜﾁｮｳ"]
[null,null,"北海道","夕張郡由仁町","ﾎｯｶｲﾄﾞｳ","ﾕｳﾊﾞﾘｸﾞﾝﾕﾆﾁｮｳ"]
[null,null,"北海道","夕張郡長沼町","ﾎｯｶｲﾄﾞｳ","ﾕｳﾊﾞﾘｸﾞﾝﾅｶﾞﾇﾏﾁｮｳ"]
[null,null,"北海道","夕張郡栗山町","ﾎｯｶｲﾄﾞｳ","ﾕｳﾊﾞﾘｸﾞﾝｸﾘﾔﾏﾁｮｳ"]
[null,null,"北海道","樺戸郡月形町","ﾎｯｶｲﾄﾞｳ","ｶﾊﾞﾄｸﾞﾝﾂｷｶﾞﾀﾁｮｳ"]
[null,null,"北海道","樺戸郡浦臼町","ﾎｯｶｲﾄﾞｳ","ｶﾊﾞﾄｸﾞﾝｳﾗｳｽﾁｮｳ"]
[null,null,"北海道","樺戸郡新十津川町","ﾎｯｶｲﾄﾞｳ","ｶﾊﾞﾄｸﾞﾝｼﾝﾄﾂｶﾜﾁｮｳ"]
[null,null,"北海道","雨竜郡妹背牛町","ﾎｯｶｲﾄﾞｳ","ｳﾘｭｳｸﾞﾝﾓｾｳｼﾁｮｳ"]
[null,null,"北海道","雨竜郡秩父別町","ﾎｯｶｲﾄﾞｳ","ｳﾘｭｳｸﾞﾝﾁｯﾌﾟﾍﾞﾂﾁｮｳ"]
[null,null,"北海道","雨竜郡雨竜町","ﾎｯｶｲﾄﾞｳ","ｳﾘｭｳｸﾞﾝｳﾘｭｳﾁｮｳ"]
[null,null,"北海道","雨竜郡北竜町","ﾎｯｶｲﾄﾞｳ","ｳﾘｭｳｸﾞﾝﾎｸﾘｭｳﾁｮｳ"]
[null,null,"北海道","雨竜郡沼田町","ﾎｯｶｲﾄﾞｳ","ｳﾘｭｳｸﾞﾝﾇﾏﾀﾁｮｳ"]
[null,null,"北海道","上川郡鷹栖町","ﾎｯｶｲﾄﾞｳ","ｶﾐｶﾜｸﾞﾝﾀｶｽﾁｮｳ"]
[null,null,"北海道","上川郡東神楽町","ﾎｯｶｲﾄﾞｳ","ｶﾐｶﾜｸﾞﾝﾋｶﾞｼｶｸﾞﾗﾁｮｳ"]
[null,null,"北海道","上川郡当麻町","ﾎｯｶｲﾄﾞｳ","ｶﾐｶﾜｸﾞﾝﾄｳﾏﾁｮｳ"]
[null,null,"北海道","上川郡比布町","ﾎｯｶｲﾄﾞｳ","ｶﾐｶﾜｸﾞﾝﾋﾟｯﾌﾟﾁｮｳ"]
[null,null,"北海道","上川郡愛別町","ﾎｯｶｲﾄﾞｳ","ｶﾐｶﾜｸﾞﾝｱｲﾍﾞﾂﾁｮｳ"]
[null,null,"北海道","上川郡上川町","ﾎｯｶｲﾄﾞｳ","ｶﾐｶﾜｸﾞﾝｶﾐｶﾜﾁｮｳ"]
[null,null,"北海道","上川郡東川町","ﾎｯｶｲﾄﾞｳ","ｶﾐｶﾜｸﾞﾝﾋｶﾞｼｶﾜﾁｮｳ"]
[null,null,"北海道","上川郡美瑛町","ﾎｯｶｲﾄﾞｳ","ｶﾐｶﾜｸﾞﾝﾋﾞｴｲﾁｮｳ"]
[null,null,"北海道","空知郡上富良野町","ﾎｯｶｲﾄﾞｳ","ｿﾗﾁｸﾞﾝｶﾐﾌﾗﾉﾁｮｳ"]
[null,null,"北海道","空知郡中富良野町","ﾎｯｶｲﾄﾞｳ","ｿﾗﾁｸﾞﾝﾅｶﾌﾗﾉﾁｮｳ"]
[null,null,"北海道","空知郡南富良野町","ﾎｯｶｲﾄﾞｳ","ｿﾗﾁｸﾞﾝﾐﾅﾐﾌﾗﾉﾁｮｳ"]
[null,null,"北海道","勇払郡占冠村","ﾎｯｶｲﾄﾞｳ","ﾕｳﾌﾂｸﾞﾝｼﾑｶｯﾌﾟﾑﾗ"]
[null,null,"北海道","上川郡和寒町","ﾎｯｶｲﾄﾞｳ","ｶﾐｶﾜｸﾞﾝﾜｯｻﾑﾁｮｳ"]
[null,null,"北海道","上川郡剣淵町","ﾎｯｶｲﾄﾞｳ","ｶﾐｶﾜｸﾞﾝｹﾝﾌﾞﾁﾁｮｳ"]
[null,null,"北海道","上川郡下川町","ﾎｯｶｲﾄﾞｳ","ｶﾐｶﾜｸﾞﾝｼﾓｶﾜﾁｮｳ"]
[null,null,"北海道","中川郡美深町","ﾎｯｶｲﾄﾞｳ","ﾅｶｶﾞﾜｸﾞﾝﾋﾞﾌｶﾁｮｳ"]
[null,null,"北海道","中川郡音威子府村","ﾎｯｶｲﾄﾞｳ","ﾅｶｶﾞﾜｸﾞﾝｵﾄｲﾈｯﾌﾟﾑﾗ"]
[null,null,"北海道","中川郡中川町","ﾎｯｶｲﾄﾞｳ","ﾅｶｶﾞﾜｸﾞﾝﾅｶｶﾞﾜﾁｮｳ"]
[null,null,"北海道","雨竜郡幌加内町","ﾎｯｶｲﾄﾞｳ","ｳﾘｭｳｸﾞﾝﾎﾛｶﾅｲﾁｮｳ"]
[null,null,"北海道","増毛郡増毛町","ﾎｯｶｲﾄﾞｳ","ﾏｼｹｸﾞﾝﾏｼｹﾁｮｳ"]
[null,null,"北海道","留萌郡小平町","ﾎｯｶｲﾄﾞｳ","ﾙﾓｲｸﾞﾝｵﾋﾞﾗﾁｮｳ"]
[null,null,"北海道","苫前郡苫前町","ﾎｯｶｲﾄﾞｳ","ﾄﾏﾏｴｸﾞﾝﾄﾏﾏｴﾁｮｳ"]
[null,null,"北海道","苫前郡羽幌町","ﾎｯｶｲﾄﾞｳ","ﾄﾏﾏｴｸﾞﾝﾊﾎﾞﾛﾁｮｳ"]
[null,null,"北海道","苫前郡初山別村","ﾎｯｶｲﾄﾞｳ","ﾄﾏﾏｴｸﾞﾝｼｮｻﾝﾍﾞﾂﾑﾗ"]
[null,null,"北海道","天塩郡遠別町","ﾎｯｶｲﾄﾞｳ","ﾃｼｵｸﾞﾝｴﾝﾍﾞﾂﾁｮｳ"]
[null,null,"北海道","天塩郡天塩町","ﾎｯｶｲﾄﾞｳ","ﾃｼｵｸﾞﾝﾃｼｵﾁｮｳ"]
[null,null,"北海道","宗谷郡猿払村","ﾎｯｶｲﾄﾞｳ","ｿｳﾔｸﾞﾝｻﾙﾌﾂﾑﾗ"]
[null,null,"北海道","枝幸郡浜頓別町","ﾎｯｶｲﾄﾞｳ","ｴｻｼｸﾞﾝﾊﾏﾄﾝﾍﾞﾂﾁｮｳ"]
[null,null,"北海道","枝幸郡中頓別町","ﾎｯｶｲﾄﾞｳ","ｴｻｼｸﾞﾝﾅｶﾄﾝﾍﾞﾂﾁｮｳ"]
[null,null,"北海道","枝幸郡枝幸町","ﾎｯｶｲﾄﾞｳ","ｴｻｼｸﾞﾝｴｻｼﾁｮｳ"]
[null,null,"北海道","天塩郡豊富町","ﾎｯｶｲﾄﾞｳ","ﾃｼｵｸﾞﾝﾄﾖﾄﾐﾁｮｳ"]
[null,null,"北海道","礼文郡礼文町","ﾎｯｶｲﾄﾞｳ","ﾚﾌﾞﾝｸﾞﾝﾚﾌﾞﾝﾁｮｳ"]
[null,null,"北海道","利尻郡利尻町","ﾎｯｶｲﾄﾞｳ","ﾘｼﾘｸﾞﾝﾘｼﾘﾁｮｳ"]
[null,null,"北海道","利尻郡利尻富士町","ﾎｯｶｲﾄﾞｳ","ﾘｼﾘｸﾞﾝﾘｼﾘﾌｼﾞﾁｮｳ"]
[null,null,"北海道","天塩郡幌延町","ﾎｯｶｲﾄﾞｳ","ﾃｼｵｸﾞﾝﾎﾛﾉﾍﾞﾁｮｳ"]
[null,null,"北海道","網走郡美幌町","ﾎｯｶｲﾄﾞｳ","ｱﾊﾞｼﾘｸﾞﾝﾋﾞﾎﾛﾁｮｳ"]
[null,null,"北海道","網走郡津別町","ﾎｯｶｲﾄﾞｳ","ｱﾊﾞｼﾘｸﾞﾝﾂﾍﾞﾂﾁｮｳ"]
[null,null,"北海道","斜里郡斜里町","ﾎｯｶｲﾄﾞｳ","ｼｬﾘｸﾞﾝｼｬﾘﾁｮｳ"]
[null,null,"北海道","斜里郡清里町","ﾎｯｶｲﾄﾞｳ","ｼｬﾘｸﾞﾝｷﾖｻﾄﾁｮｳ"]
[null,null,"北海道","斜里郡小清水町","ﾎｯｶｲﾄﾞｳ","ｼｬﾘｸﾞﾝｺｼﾐｽﾞﾁｮｳ"]
[null,null,"北海道","常呂郡訓子府町","ﾎｯｶｲﾄﾞｳ","ﾄｺﾛｸﾞﾝｸﾝﾈｯﾌﾟﾁｮｳ"]
[null,null,"北海道","常呂郡置戸町","ﾎｯｶｲﾄﾞｳ","ﾄｺﾛｸﾞﾝｵｹﾄﾁｮｳ"]
[null,null,"北海道","常呂郡佐呂間町","ﾎｯｶｲﾄﾞｳ","ﾄｺﾛｸﾞﾝｻﾛﾏﾁｮｳ"]
[null,null,"北海道","紋別郡遠軽町","ﾎｯｶｲﾄﾞｳ","ﾓﾝﾍﾞﾂｸﾞﾝｴﾝｶﾞﾙﾁｮｳ"]
[null,null,"北海道","紋別郡湧別町","ﾎｯｶｲﾄﾞｳ","ﾓﾝﾍﾞﾂｸﾞﾝﾕｳﾍﾞﾂﾁｮｳ"]
[null,null,"北海道","紋別郡滝上町","ﾎｯｶｲﾄﾞｳ","ﾓﾝﾍﾞﾂｸﾞﾝﾀｷﾉｳｴﾁｮｳ"]
[null,null,"北海道","紋別郡興部町","ﾎｯｶｲﾄﾞｳ","ﾓﾝﾍﾞﾂｸﾞﾝｵｺｯﾍﾟﾁｮｳ"]
[null,null,"北海道","紋別郡西興部村","ﾎｯｶｲﾄﾞｳ","ﾓﾝﾍﾞﾂｸﾞﾝﾆｼｵｺｯﾍﾟﾑﾗ"]
[null,null,"北海道","紋別郡雄武町","ﾎｯｶｲﾄﾞｳ","ﾓﾝﾍﾞﾂｸﾞﾝｵｳﾑﾁｮｳ"]
[null,null,"北海道","網走郡大空町","ﾎｯｶｲﾄﾞｳ","ｱﾊﾞｼﾘｸﾞﾝｵｵｿﾞﾗﾁｮｳ"]
[null,null,"北海道","虻田郡豊浦町","ﾎｯｶｲﾄﾞｳ","ｱﾌﾞﾀｸﾞﾝﾄﾖｳﾗﾁｮｳ"]
[null,null,"北海道","有珠郡壮瞥町","ﾎｯｶｲﾄﾞｳ","ｳｽｸﾞﾝｿｳﾍﾞﾂﾁｮｳ"]
[null,null,"北海道","白老郡白老町","ﾎｯｶｲﾄﾞｳ","ｼﾗｵｲｸﾞﾝｼﾗｵｲﾁｮｳ"]
[null,null,"北海道","勇払郡厚真町","ﾎｯｶｲﾄﾞｳ","ﾕｳﾌﾂｸﾞﾝｱﾂﾏﾁｮｳ"]
[null,null,"北海道","虻田郡洞爺湖町","ﾎｯｶｲﾄﾞｳ","ｱﾌﾞﾀｸﾞﾝﾄｳﾔｺﾁｮｳ"]
[null,null,"北海道","勇払郡安平町","ﾎｯｶｲﾄﾞｳ","ﾕｳﾌﾂｸﾞﾝｱﾋﾞﾗﾁｮｳ"]
[null,null,"北海道","勇払郡むかわ町","ﾎｯｶｲﾄﾞｳ","ﾕｳﾌﾂｸﾞﾝﾑｶﾜﾁｮｳ"]
[null,null,"北海道","沙流郡日高町","ﾎｯｶｲﾄﾞｳ","ｻﾙｸﾞﾝﾋﾀﾞｶﾁｮｳ"]
[null,null,"北海道","沙流郡平取町","ﾎｯｶｲﾄﾞｳ","ｻﾙｸﾞﾝﾋﾞﾗﾄﾘﾁｮｳ"]
[null,null,"北海道","新冠郡新冠町","ﾎｯｶｲﾄﾞｳ","ﾆｲｶｯﾌﾟｸﾞﾝﾆｲｶｯﾌﾟﾁｮｳ"]
[null,null,"北海道","浦河郡浦河町","ﾎｯｶｲﾄﾞｳ","ｳﾗｶﾜｸﾞﾝｳﾗｶﾜﾁｮｳ"]
[null,null,"北海道","様似郡様似町","ﾎｯｶｲﾄﾞｳ","ｻﾏﾆｸﾞﾝｻﾏﾆﾁｮｳ"]
[null,null,"北海道","幌泉郡えりも町","ﾎｯｶｲﾄﾞｳ","ﾎﾛｲｽﾞﾐｸﾞﾝｴﾘﾓﾁｮｳ"]
[null,null,"北海道","日高郡新ひだか町","ﾎｯｶｲﾄﾞｳ","ﾋﾀﾞｶｸﾞﾝｼﾝﾋﾀﾞｶﾁｮｳ"]
[null,null,"北海道","河東郡音更町","ﾎｯｶｲﾄﾞｳ","ｶﾄｳｸﾞﾝｵﾄﾌｹﾁｮｳ"]
[null,null,"北海道","河東郡士幌町","ﾎｯｶｲﾄﾞｳ","ｶﾄｳｸﾞﾝｼﾎﾛﾁｮｳ"]
[null,null,"北海道","河東郡上士幌町","ﾎｯｶｲﾄﾞｳ","ｶﾄｳｸﾞﾝｶﾐｼﾎﾛﾁｮｳ"]
[null,null,"北海道","河東郡鹿追町","ﾎｯｶｲﾄﾞｳ","ｶﾄｳｸﾞﾝｼｶｵｲﾁｮｳ"]
[null,null,"北海道","上川郡新得町","ﾎｯｶｲﾄﾞｳ","ｶﾐｶﾜｸﾞﾝｼﾝﾄｸﾁｮｳ"]
[null,null,"北海道","上川郡清水町","ﾎｯｶｲﾄﾞｳ","ｶﾐｶﾜｸﾞﾝｼﾐｽﾞﾁｮｳ"]
[null,null,"北海道","河西郡芽室町","ﾎｯｶｲﾄﾞｳ","ｶｻｲｸﾞﾝﾒﾑﾛﾁｮｳ"]
[null,null,"北海道","河西郡中札内村","ﾎｯｶｲﾄﾞｳ","ｶｻｲｸﾞﾝﾅｶｻﾂﾅｲﾑﾗ"]
[null,null,"北海道","河西郡更別村","ﾎｯｶｲﾄﾞｳ","ｶｻｲｸﾞﾝｻﾗﾍﾞﾂﾑﾗ"]
[null,null,"北海道","広尾郡大樹町","ﾎｯｶｲﾄﾞｳ","ﾋﾛｵｸﾞﾝﾀｲｷﾁｮｳ"]
[null,null,"北海道","広尾郡広尾町","ﾎｯｶｲﾄﾞｳ","ﾋﾛｵｸﾞﾝﾋﾛｵﾁｮｳ"]
[null,null,"北海道","中川郡幕別町","ﾎｯｶｲﾄﾞｳ","ﾅｶｶﾞﾜｸﾞﾝﾏｸﾍﾞﾂﾁｮｳ"]
[null,null,"北海道","中川郡池田町","ﾎｯｶｲﾄﾞｳ","ﾅｶｶﾞﾜｸﾞﾝｲｹﾀﾞﾁｮｳ"]
[null,null,"北海道","中川郡豊頃町","ﾎｯｶｲﾄﾞｳ","ﾅｶｶﾞﾜｸﾞﾝﾄﾖｺﾛﾁｮｳ"]
[null,null,"北海道","中川郡本別町","ﾎｯｶｲﾄﾞｳ","ﾅｶｶﾞﾜｸﾞﾝﾎﾝﾍﾞﾂﾁｮｳ"]
[null,null,"北海道","足寄郡足寄町","ﾎｯｶｲﾄﾞｳ","ｱｼｮﾛｸﾞﾝｱｼｮﾛﾁｮｳ"]
[null,null,"北海道","足寄郡陸別町","ﾎｯｶｲﾄﾞｳ","ｱｼｮﾛｸﾞﾝﾘｸﾍﾞﾂﾁｮｳ"]
[null,null,"北海道","十勝郡浦幌町","ﾎｯｶｲﾄﾞｳ","ﾄｶﾁｸﾞﾝｳﾗﾎﾛﾁｮｳ"]
[null,null,"北海道","釧路郡釧路町","ﾎｯｶｲﾄﾞｳ","ｸｼﾛｸﾞﾝｸｼﾛﾁｮｳ"]
[null,null,"北海道","厚岸郡厚岸町","ﾎｯｶｲﾄﾞｳ","ｱｯｹｼｸﾞﾝｱｯｹｼﾁｮｳ"]
[null,null,"北海道","厚岸郡浜中町","ﾎｯｶｲﾄﾞｳ","ｱｯｹｼｸﾞﾝﾊﾏﾅｶﾁｮｳ"]
[null,null,"北海道","川上郡標茶町","ﾎｯｶｲﾄﾞｳ","ｶﾜｶﾐｸﾞﾝｼﾍﾞﾁｬﾁｮｳ"]
[null,null,"北海道","川上郡弟子屈町","ﾎｯｶｲﾄﾞｳ","ｶﾜｶﾐｸﾞﾝﾃｼｶｶﾞﾁｮｳ"]
[null,null,"北海道","阿寒郡鶴居村","ﾎｯｶｲﾄﾞｳ","ｱｶﾝｸﾞﾝﾂﾙｲﾑﾗ"]
[null,null,"北海道","白糠郡白糠町","ﾎｯｶｲﾄﾞｳ","ｼﾗﾇｶｸﾞﾝｼﾗﾇｶﾁｮｳ"]
[null,null,"北海道","野付郡別海町","ﾎｯｶｲﾄﾞｳ","ﾉﾂｹｸﾞﾝﾍﾞﾂｶｲﾁｮｳ"]
[null,null,"北海道","標津郡中標津町","ﾎｯｶｲﾄﾞｳ","ｼﾍﾞﾂｸﾞﾝﾅｶｼﾍﾞﾂﾁｮｳ"]
[null,null,"北海道","標津郡標津町","ﾎｯｶｲﾄﾞｳ","ｼﾍﾞﾂｸﾞﾝｼﾍﾞﾂﾁｮｳ"]
[null,null,"北海道","目梨郡羅臼町","ﾎｯｶｲﾄﾞｳ","ﾒﾅｼｸﾞﾝﾗｳｽﾁｮｳ"]
[null,null,"青森県","青森市","ｱｵﾓﾘｹﾝ","ｱｵﾓﾘｼ"]
[null,null,"青森県","弘前市","ｱｵﾓﾘｹﾝ","ﾋﾛｻｷｼ"]
[null,null,"青森県","八戸市","ｱｵﾓﾘｹﾝ","ﾊﾁﾉﾍｼ"]
[null,null,"青森県","黒石市","ｱｵﾓﾘｹﾝ","ｸﾛｲｼｼ"]
[null,null,"青森県","五所川原市","ｱｵﾓﾘｹﾝ","ｺﾞｼｮｶﾞﾜﾗｼ"]
[null,null,"青森県","十和田市","ｱｵﾓﾘｹﾝ","ﾄﾜﾀﾞｼ"]
[null,null,"青森県","三沢市","ｱｵﾓﾘｹﾝ","ﾐｻﾜｼ"]
[null,null,"青森県","むつ市","ｱｵﾓﾘｹﾝ","ﾑﾂｼ"]
[null,null,"青森県","つがる市","ｱｵﾓﾘｹﾝ","ﾂｶﾞﾙｼ"]
[null,null,"青森県","平川市","ｱｵﾓﾘｹﾝ","ﾋﾗｶﾜｼ"]
[null,null,"青森県","東津軽郡平内町","ｱｵﾓﾘｹﾝ","ﾋｶﾞｼﾂｶﾞﾙｸﾞﾝﾋﾗﾅｲﾏﾁ"]
[null,null,"青森県","東津軽郡今別町","ｱｵﾓﾘｹﾝ","ﾋｶﾞｼﾂｶﾞﾙｸﾞﾝｲﾏﾍﾞﾂﾏﾁ"]
[null,null,"青森県","東津軽郡蓬田村","ｱｵﾓﾘｹﾝ","ﾋｶﾞｼﾂｶﾞﾙｸﾞﾝﾖﾓｷﾞﾀﾑﾗ"]
[null,null,"青森県","東津軽郡外ヶ浜町","ｱｵﾓﾘｹﾝ","ﾋｶﾞｼﾂｶﾞﾙｸﾞﾝｿﾄｶﾞﾊﾏﾏﾁ"]
[null,null,"青森県","西津軽郡鰺ヶ沢町","ｱｵﾓﾘｹﾝ","ﾆｼﾂｶﾞﾙｸﾞﾝｱｼﾞｶﾞｻﾜﾏﾁ"]
[null,null,"青森県","西津軽郡深浦町","ｱｵﾓﾘｹﾝ","ﾆｼﾂｶﾞﾙｸﾞﾝﾌｶｳﾗﾏﾁ"]
[null,null,"青森県","中津軽郡西目屋村","ｱｵﾓﾘｹﾝ","ﾅｶﾂｶﾞﾙｸﾞﾝﾆｼﾒﾔﾑﾗ"]
[null,null,"青森県","南津軽郡藤崎町","ｱｵﾓﾘｹﾝ","ﾐﾅﾐﾂｶﾞﾙｸﾞﾝﾌｼﾞｻｷﾏﾁ"]
[null,null,"青森県","南津軽郡大鰐町","ｱｵﾓﾘｹﾝ","ﾐﾅﾐﾂｶﾞﾙｸﾞﾝｵｵﾜﾆﾏﾁ"]
[null,null,"青森県","南津軽郡田舎館村","ｱｵﾓﾘｹﾝ","ﾐﾅﾐﾂｶﾞﾙｸﾞﾝｲﾅｶﾀﾞﾃﾑﾗ"]
[null,null,"青森県","北津軽郡板柳町","ｱｵﾓﾘｹﾝ","ｷﾀﾂｶﾞﾙｸﾞﾝｲﾀﾔﾅｷﾞﾏﾁ"]
[null,null,"青森県","北津軽郡鶴田町","ｱｵﾓﾘｹﾝ","ｷﾀﾂｶﾞﾙｸﾞﾝﾂﾙﾀﾏﾁ"]
[null,null,"青森県","北津軽郡中泊町","ｱｵﾓﾘｹﾝ","ｷﾀﾂｶﾞﾙｸﾞﾝﾅｶﾄﾞﾏﾘﾏﾁ"]
[null,null,"青森県","上北郡野辺地町","ｱｵﾓﾘｹﾝ","ｶﾐｷﾀｸﾞﾝﾉﾍｼﾞﾏﾁ"]
[null,null,"青森県","上北郡七戸町","ｱｵﾓﾘｹﾝ","ｶﾐｷﾀｸﾞﾝｼﾁﾉﾍﾏﾁ"]
[null,null,"青森県","上北郡六戸町","ｱｵﾓﾘｹﾝ","ｶﾐｷﾀｸﾞﾝﾛｸﾉﾍﾏﾁ"]
[null,null,"青森県","上北郡横浜町","ｱｵﾓﾘｹﾝ","ｶﾐｷﾀｸﾞﾝﾖｺﾊﾏﾏﾁ"]
[null,null,"青森県","上北郡東北町","ｱｵﾓﾘｹﾝ","ｶﾐｷﾀｸﾞﾝﾄｳﾎｸﾏﾁ"]
[null,null,"青森県","上北郡六ヶ所村","ｱｵﾓﾘｹﾝ","ｶﾐｷﾀｸﾞﾝﾛｯｶｼｮﾑﾗ"]
[null,null,"青森県","上北郡おいらせ町","ｱｵﾓﾘｹﾝ","ｶﾐｷﾀｸﾞﾝｵｲﾗｾﾁｮｳ"]
[null,null,"青森県","下北郡大間町","ｱｵﾓﾘｹﾝ","ｼﾓｷﾀｸﾞﾝｵｵﾏﾏﾁ"]
[null,null,"青森県","下北郡東通村","ｱｵﾓﾘｹﾝ","ｼﾓｷﾀｸﾞﾝﾋｶﾞｼﾄﾞｵﾘﾑﾗ"]
[null,null,"青森県","下北郡風間浦村","ｱｵﾓﾘｹﾝ","ｼﾓｷﾀｸﾞﾝｶｻﾞﾏｳﾗﾑﾗ"]
[null,null,"青森県","下北郡佐井村","ｱｵﾓﾘｹﾝ","ｼﾓｷﾀｸﾞﾝｻｲﾑﾗ"]
[null,null,"青森県","三戸郡三戸町","ｱｵﾓﾘｹﾝ","ｻﾝﾉﾍｸﾞﾝｻﾝﾉﾍﾏﾁ"]
[null,null,"青森県","三戸郡五戸町","ｱｵﾓﾘｹﾝ","ｻﾝﾉﾍｸﾞﾝｺﾞﾉﾍﾏﾁ"]
[null,null,"青森県","三戸郡田子町","ｱｵﾓﾘｹﾝ","ｻﾝﾉﾍｸﾞﾝﾀｯｺﾏﾁ"]
[null,null,"青森県","三戸郡南部町","ｱｵﾓﾘｹﾝ","ｻﾝﾉﾍｸﾞﾝﾅﾝﾌﾞﾁｮｳ"]
[null,null,"青森県","三戸郡階上町","ｱｵﾓﾘｹﾝ","ｻﾝﾉﾍｸﾞﾝﾊｼｶﾐﾁｮｳ"]
[null,null,"青森県","三戸郡新郷村","ｱｵﾓﾘｹﾝ","ｻﾝﾉﾍｸﾞﾝｼﾝｺﾞｳﾑﾗ"]
[null,null,"岩手県","盛岡市","ｲﾜﾃｹﾝ","ﾓﾘｵｶｼ"]
[null,null,"岩手県","宮古市","ｲﾜﾃｹﾝ","ﾐﾔｺｼ"]
[null,null,"岩手県","大船渡市","ｲﾜﾃｹﾝ","ｵｵﾌﾅﾄｼ"]
[null,null,"岩手県","花巻市","ｲﾜﾃｹﾝ","ﾊﾅﾏｷｼ"]
[null,null,"岩手県","北上市","ｲﾜﾃｹﾝ","ｷﾀｶﾐｼ"]
[null,null,"岩手県","久慈市","ｲﾜﾃｹﾝ","ｸｼﾞｼ"]
[null,null,"岩手県","遠野市","ｲﾜﾃｹﾝ","ﾄｵﾉｼ"]
[null,null,"岩手県","一関市","ｲﾜﾃｹﾝ","ｲﾁﾉｾｷｼ"]
[null,null,"岩手県","陸前高田市","ｲﾜﾃｹﾝ","ﾘｸｾﾞﾝﾀｶﾀｼ"]
[null,null,"岩手県","釜石市","ｲﾜﾃｹﾝ","ｶﾏｲｼｼ"]
[null,null,"岩手県","二戸市","ｲﾜﾃｹﾝ","ﾆﾉﾍｼ"]
[null,null,"岩手県","八幡平市","ｲﾜﾃｹﾝ","ﾊﾁﾏﾝﾀｲｼ"]
[null,null,"岩手県","奥州市","ｲﾜﾃｹﾝ","ｵｳｼｭｳｼ"]
[null,null,"岩手県","滝沢市","ｲﾜﾃｹﾝ","ﾀｷｻﾞﾜｼ"]
[null,null,"岩手県","岩手郡雫石町","ｲﾜﾃｹﾝ","ｲﾜﾃｸﾞﾝｼｽﾞｸｲｼﾁｮｳ"]
[null,null,"岩手県","岩手郡葛巻町","ｲﾜﾃｹﾝ","ｲﾜﾃｸﾞﾝｸｽﾞﾏｷﾏﾁ"]
[null,null,"岩手県","岩手郡岩手町","ｲﾜﾃｹﾝ","ｲﾜﾃｸﾞﾝｲﾜﾃﾏﾁ"]
[null,null,"岩手県","紫波郡紫波町","ｲﾜﾃｹﾝ","ｼﾜｸﾞﾝｼﾜﾁｮｳ"]
[null,null,"岩手県","紫波郡矢巾町","ｲﾜﾃｹﾝ","ｼﾜｸﾞﾝﾔﾊﾊﾞﾁｮｳ"]
[null,null,"岩手県","和賀郡西和賀町","ｲﾜﾃｹﾝ","ﾜｶﾞｸﾞﾝﾆｼﾜｶﾞﾏﾁ"]
[null,null,"岩手県","胆沢郡金ケ崎町","ｲﾜﾃｹﾝ","ｲｻﾜｸﾞﾝｶﾈｶﾞｻｷﾁｮｳ"]
[null,null,"岩手県","西磐井郡平泉町","ｲﾜﾃｹﾝ","ﾆｼｲﾜｲｸﾞﾝﾋﾗｲｽﾞﾐﾁｮｳ"]
[null,null,"岩手県","気仙郡住田町","ｲﾜﾃｹﾝ","ｹｾﾝｸﾞﾝｽﾐﾀﾁｮｳ"]
[null,null,"岩手県","上閉伊郡大槌町","ｲﾜﾃｹﾝ","ｶﾐﾍｲｸﾞﾝｵｵﾂﾁﾁｮｳ"]
[null,null,"岩手県","下閉伊郡山田町","ｲﾜﾃｹﾝ","ｼﾓﾍｲｸﾞﾝﾔﾏﾀﾞﾏﾁ"]
[null,null,"岩手県","下閉伊郡岩泉町","ｲﾜﾃｹﾝ","ｼﾓﾍｲｸﾞﾝｲﾜｲｽﾞﾐﾁｮｳ"]
[null,null,"岩手県","下閉伊郡田野畑村","ｲﾜﾃｹﾝ","ｼﾓﾍｲｸﾞﾝﾀﾉﾊﾀﾑﾗ"]
[null,null,"岩手県","下閉伊郡普代村","ｲﾜﾃｹﾝ","ｼﾓﾍｲｸﾞﾝﾌﾀﾞｲﾑﾗ"]
[null,null,"岩手県","九戸郡軽米町","ｲﾜﾃｹﾝ","ｸﾉﾍｸﾞﾝｶﾙﾏｲﾏﾁ"]
[null,null,"岩手県","九戸郡野田村","ｲﾜﾃｹﾝ","ｸﾉﾍｸﾞﾝﾉﾀﾞﾑﾗ"]
[null,null,"岩手県","九戸郡九戸村","ｲﾜﾃｹﾝ","ｸﾉﾍｸﾞﾝｸﾉﾍﾑﾗ"]
[null,null,"岩手県","九戸郡洋野町","ｲﾜﾃｹﾝ","ｸﾉﾍｸﾞﾝﾋﾛﾉﾁｮｳ"]
[null,null,"岩手県","二戸郡一戸町","ｲﾜﾃｹﾝ","ﾆﾉﾍｸﾞﾝｲﾁﾉﾍﾏﾁ"]
[null,null,"宮城県","仙台市青葉区","ﾐﾔｷﾞｹﾝ","ｾﾝﾀﾞｲｼｱｵﾊﾞｸ"]
[null,null,"宮城県","仙台市宮城野区","ﾐﾔｷﾞｹﾝ","ｾﾝﾀﾞｲｼﾐﾔｷﾞﾉｸ"]
[null,null,"宮城県","仙台市若林区","ﾐﾔｷﾞｹﾝ","ｾﾝﾀﾞｲｼﾜｶﾊﾞﾔｼｸ"]
[null,null,"宮城県","仙台市太白区","ﾐﾔｷﾞｹﾝ","ｾﾝﾀﾞｲｼﾀｲﾊｸｸ"]
[null,null,"宮城県","仙台市泉区","ﾐﾔｷﾞｹﾝ","ｾﾝﾀﾞｲｼｲｽﾞﾐｸ"]
[null,null,"宮城県","石巻市","ﾐﾔｷﾞｹﾝ","ｲｼﾉﾏｷｼ"]
[null,null,"宮城県","塩竈市","ﾐﾔｷﾞｹﾝ","ｼｵｶﾞﾏｼ"]
[null,null,"宮城県","気仙沼市","ﾐﾔｷﾞｹﾝ","ｹｾﾝﾇﾏｼ"]
[null,null,"宮城県","白石市","ﾐﾔｷﾞｹﾝ","ｼﾛｲｼｼ"]
[null,null,"宮城県","名取市","ﾐﾔｷﾞｹﾝ","ﾅﾄﾘｼ"]
[null,null,"宮城県","角田市","ﾐﾔｷﾞｹﾝ","ｶｸﾀﾞｼ"]
[null,null,"宮城県","多賀城市","ﾐﾔｷﾞｹﾝ","ﾀｶﾞｼﾞｮｳｼ"]
[null,null,"宮城県","岩沼市","ﾐﾔｷﾞｹﾝ","ｲﾜﾇﾏｼ"]
[null,null,"宮城県","登米市","ﾐﾔｷﾞｹﾝ","ﾄﾒｼ"]
[null,null,"宮城県","栗原市","ﾐﾔｷﾞｹﾝ","ｸﾘﾊﾗｼ"]
[null,null,"宮城県","東松島市","ﾐﾔｷﾞｹﾝ","ﾋｶﾞｼﾏﾂｼﾏｼ"]
[null,null,"宮城県","大崎市","ﾐﾔｷﾞｹﾝ","ｵｵｻｷｼ"]
[null,null,"宮城県","富谷市","ﾐﾔｷﾞｹﾝ","ﾄﾐﾔｼ"]
[null,null,"宮城県","刈田郡蔵王町","ﾐﾔｷﾞｹﾝ","ｶｯﾀｸﾞﾝｻﾞｵｳﾏﾁ"]
[null,null,"宮城県","刈田郡七ヶ宿町","ﾐﾔｷﾞｹﾝ","ｶｯﾀｸﾞﾝｼﾁｶｼｭｸﾏﾁ"]
[null,null,"宮城県","柴田郡大河原町","ﾐﾔｷﾞｹﾝ","ｼﾊﾞﾀｸﾞﾝｵｵｶﾞﾜﾗﾏﾁ"]
[null,null,"宮城県","柴田郡村田町","ﾐﾔｷﾞｹﾝ","ｼﾊﾞﾀｸﾞﾝﾑﾗﾀﾏﾁ"]
[null,null,"宮城県","柴田郡柴田町","ﾐﾔｷﾞｹﾝ","ｼﾊﾞﾀｸﾞﾝｼﾊﾞﾀﾏﾁ"]
[null,null,"宮城県","柴田郡川崎町","ﾐﾔｷﾞｹﾝ","ｼﾊﾞﾀｸﾞﾝｶﾜｻｷﾏﾁ"]
[null,null,"宮城県","伊具郡丸森町","ﾐﾔｷﾞｹﾝ","ｲｸﾞｸﾞﾝﾏﾙﾓﾘﾏﾁ"]
[null,null,"宮城県","亘理郡亘理町","ﾐﾔｷﾞｹﾝ","ﾜﾀﾘｸﾞﾝﾜﾀﾘﾁｮｳ"]
[null,null,"宮城県","亘理郡山元町","ﾐﾔｷﾞｹﾝ","ﾜﾀﾘｸﾞﾝﾔﾏﾓﾄﾁｮｳ"]
[null,null,"宮城県","宮城郡松島町","ﾐﾔｷﾞｹﾝ","ﾐﾔｷﾞｸﾞﾝﾏﾂｼﾏﾏﾁ"]
[null,null,"宮城県","宮城郡七ヶ浜町","ﾐﾔｷﾞｹﾝ","ﾐﾔｷﾞｸﾞﾝｼﾁｶﾞﾊﾏﾏﾁ"]
[null,null,"宮城県","宮城郡利府町","ﾐﾔｷﾞｹﾝ","ﾐﾔｷﾞｸﾞﾝﾘﾌﾁｮｳ"]
[null,null,"宮城県","黒川郡大和町","ﾐﾔｷﾞｹﾝ","ｸﾛｶﾜｸﾞﾝﾀｲﾜﾁｮｳ"]
[null,null,"宮城県","黒川郡大郷町","ﾐﾔｷﾞｹﾝ","ｸﾛｶﾜｸﾞﾝｵｵｻﾄﾁｮｳ"]
[null,null,"宮城県","黒川郡大衡村","ﾐﾔｷﾞｹﾝ","ｸﾛｶﾜｸﾞﾝｵｵﾋﾗﾑﾗ"]
[null,null,"宮城県","加美郡色麻町","ﾐﾔｷﾞｹﾝ","ｶﾐｸﾞﾝｼｶﾏﾁｮｳ"]
[null,null,"宮城県","加美郡加美町","ﾐﾔｷﾞｹﾝ","ｶﾐｸﾞﾝｶﾐﾏﾁ"]
[null,null,"宮城県","遠田郡涌谷町","ﾐﾔｷﾞｹﾝ","ﾄｵﾀﾞｸﾞﾝﾜｸﾔﾁｮｳ"]
[null,null,"宮城県","遠田郡美里町","ﾐﾔｷﾞｹﾝ","ﾄｵﾀﾞｸﾞﾝﾐｻﾄﾏﾁ"]
[null,null,"宮城県","牡鹿郡女川町","ﾐﾔｷﾞｹﾝ","ｵｼｶｸﾞﾝｵﾅｶﾞﾜﾁｮｳ"]
[null,null,"宮城県","本吉郡南三陸町","ﾐﾔｷﾞｹﾝ","ﾓﾄﾖｼｸﾞﾝﾐﾅﾐｻﾝﾘｸﾁｮｳ"]
[null,null,"秋田県","秋田市","ｱｷﾀｹﾝ","ｱｷﾀｼ"]
[null,null,"秋田県","能代市","ｱｷﾀｹﾝ","ﾉｼﾛｼ"]
[null,null,"秋田県","横手市","ｱｷﾀｹﾝ","ﾖｺﾃｼ"]
[null,null,"秋田県","大館市","ｱｷﾀｹﾝ","ｵｵﾀﾞﾃｼ"]
[null,null,"秋田県","男鹿市","ｱｷﾀｹﾝ","ｵｶﾞｼ"]
[null,null,"秋田県","湯沢市","ｱｷﾀｹﾝ","ﾕｻﾞﾜｼ"]
[null,null,"秋田県","鹿角市","ｱｷﾀｹﾝ","ｶﾂﾞﾉｼ"]
[null,null,"秋田県","由利本荘市","ｱｷﾀｹﾝ","ﾕﾘﾎﾝｼﾞｮｳｼ"]
[null,null,"秋田県","潟上市","ｱｷﾀｹﾝ","ｶﾀｶﾞﾐｼ"]
[null,null,"秋田県","大仙市","ｱｷﾀｹﾝ","ﾀﾞｲｾﾝｼ"]
[null,null,"秋田県","北秋田市","ｱｷﾀｹﾝ","ｷﾀｱｷﾀｼ"]
[null,null,"秋田県","にかほ市","ｱｷﾀｹﾝ","ﾆｶﾎｼ"]
[null,null,"秋田県","仙北市","ｱｷﾀｹﾝ","ｾﾝﾎﾞｸｼ"]
[null,null,"秋田県","鹿角郡小坂町","ｱｷﾀｹﾝ","ｶﾂﾞﾉｸﾞﾝｺｻｶﾏﾁ"]
[null,null,"秋田県","北秋田郡上小阿仁村","ｱｷﾀｹﾝ","ｷﾀｱｷﾀｸﾞﾝｶﾐｺｱﾆﾑﾗ"]
[null,null,"秋田県","山本郡藤里町","ｱｷﾀｹﾝ","ﾔﾏﾓﾄｸﾞﾝﾌｼﾞｻﾄﾏﾁ"]
[null,null,"秋田県","山本郡三種町","ｱｷﾀｹﾝ","ﾔﾏﾓﾄｸﾞﾝﾐﾀﾈﾁｮｳ"]
[null,null,"秋田県","山本郡八峰町","ｱｷﾀｹﾝ","ﾔﾏﾓﾄｸﾞﾝﾊｯﾎﾟｳﾁｮｳ"]
[null,null,"秋田県","南秋田郡五城目町","ｱｷﾀｹﾝ","ﾐﾅﾐｱｷﾀｸﾞﾝｺﾞｼﾞｮｳﾒﾏﾁ"]
[null,null,"秋田県","南秋田郡八郎潟町","ｱｷﾀｹﾝ","ﾐﾅﾐｱｷﾀｸﾞﾝﾊﾁﾛｳｶﾞﾀﾏﾁ"]
[null,null,"秋田県","南秋田郡井川町","ｱｷﾀｹﾝ","ﾐﾅﾐｱｷﾀｸﾞﾝｲｶﾜﾏﾁ"]
[null,null,"秋田県","南秋田郡大潟村","ｱｷﾀｹﾝ","ﾐﾅﾐｱｷﾀｸﾞﾝｵｵｶﾞﾀﾑﾗ"]
[null,null,"秋田県","仙北郡美郷町","ｱｷﾀｹﾝ","ｾﾝﾎﾞｸｸﾞﾝﾐｻﾄﾁｮｳ"]
[null,null,"秋田県","雄勝郡羽後町","ｱｷﾀｹﾝ","ｵｶﾞﾁｸﾞﾝｳｺﾞﾏﾁ"]
[null,null,"秋田県","雄勝郡東成瀬村","ｱｷﾀｹﾝ","ｵｶﾞﾁｸﾞﾝﾋｶﾞｼﾅﾙｾﾑﾗ"]
[null,null,"山形県","山形市","ﾔﾏｶﾞﾀｹﾝ","ﾔﾏｶﾞﾀｼ"]
[null,null,"山形県","米沢市","ﾔﾏｶﾞﾀｹﾝ","ﾖﾈｻﾞﾜｼ"]
[null,null,"山形県","鶴岡市","ﾔﾏｶﾞﾀｹﾝ","ﾂﾙｵｶｼ"]
[null,null,"山形県","酒田市","ﾔﾏｶﾞﾀｹﾝ","ｻｶﾀｼ"]
[null,null,"山形県","新庄市","ﾔﾏｶﾞﾀｹﾝ","ｼﾝｼﾞｮｳｼ"]
[null,null,"山形県","寒河江市","ﾔﾏｶﾞﾀｹﾝ","ｻｶﾞｴｼ"]
[null,null,"山形県","上山市","ﾔﾏｶﾞﾀｹﾝ","ｶﾐﾉﾔﾏｼ"]
[null,null,"山形県","村山市","ﾔﾏｶﾞﾀｹﾝ","ﾑﾗﾔﾏｼ"]
[null,null,"山形県","長井市","ﾔﾏｶﾞﾀｹﾝ","ﾅｶﾞｲｼ"]
[null,null,"山形県","天童市","ﾔﾏｶﾞﾀｹﾝ","ﾃﾝﾄﾞｳｼ"]
[null,null,"山形県","東根市","ﾔﾏｶﾞﾀｹﾝ","ﾋｶﾞｼﾈｼ"]
[null,null,"山形県","尾花沢市","ﾔﾏｶﾞﾀｹﾝ","ｵﾊﾞﾅｻﾞﾜｼ"]
[null,null,"山形県","南陽市","ﾔﾏｶﾞﾀｹﾝ","ﾅﾝﾖｳｼ"]
[null,null,"山形県","東村山郡山辺町","ﾔﾏｶﾞﾀｹﾝ","ﾋｶﾞｼﾑﾗﾔﾏｸﾞﾝﾔﾏﾉﾍﾞﾏﾁ"]
[null,null,"山形県","東村山郡中山町","ﾔﾏｶﾞﾀｹﾝ","ﾋｶﾞｼﾑﾗﾔﾏｸﾞﾝﾅｶﾔﾏﾏﾁ"]
[null,null,"山形県","西村山郡河北町","ﾔﾏｶﾞﾀｹﾝ","ﾆｼﾑﾗﾔﾏｸﾞﾝｶﾎｸﾁｮｳ"]
[null,null,"山形県","西村山郡西川町","ﾔﾏｶﾞﾀｹﾝ","ﾆｼﾑﾗﾔﾏｸﾞﾝﾆｼｶﾜﾏﾁ"]
[null,null,"山形県","西村山郡朝日町","ﾔﾏｶﾞﾀｹﾝ","ﾆｼﾑﾗﾔﾏｸﾞﾝｱｻﾋﾏﾁ"]
[null,null,"山形県","西村山郡大江町","ﾔﾏｶﾞﾀｹﾝ","ﾆｼﾑﾗﾔﾏｸﾞﾝｵｵｴﾏﾁ"]
[null,null,"山形県","北村山郡大石田町","ﾔﾏｶﾞﾀｹﾝ","ｷﾀﾑﾗﾔﾏｸﾞﾝｵｵｲｼﾀﾞﾏﾁ"]
[null,null,"山形県","最上郡金山町","ﾔﾏｶﾞﾀｹﾝ","ﾓｶﾞﾐｸﾞﾝｶﾈﾔﾏﾏﾁ"]
[null,null,"山形県","最上郡最上町","ﾔﾏｶﾞﾀｹﾝ","ﾓｶﾞﾐｸﾞﾝﾓｶﾞﾐﾏﾁ"]
[null,null,"山形県","最上郡舟形町","ﾔﾏｶﾞﾀｹﾝ","ﾓｶﾞﾐｸﾞﾝﾌﾅｶﾞﾀﾏﾁ"]
[null,null,"山形県","最上郡真室川町","ﾔﾏｶﾞﾀｹﾝ","ﾓｶﾞﾐｸﾞﾝﾏﾑﾛｶﾞﾜﾏﾁ"]
[null,null,"山形県","最上郡大蔵村","ﾔﾏｶﾞﾀｹﾝ","ﾓｶﾞﾐｸﾞﾝｵｵｸﾗﾑﾗ"]
[null,null,"山形県","最上郡鮭川村","ﾔﾏｶﾞﾀｹﾝ","ﾓｶﾞﾐｸﾞﾝｻｹｶﾞﾜﾑﾗ"]
[null,null,"山形県","最上郡戸沢村","ﾔﾏｶﾞﾀｹﾝ","ﾓｶﾞﾐｸﾞﾝﾄｻﾞﾜﾑﾗ"]
[null,null,"山形県","東置賜郡高畠町","ﾔﾏｶﾞﾀｹﾝ","ﾋｶﾞｼｵｷﾀﾏｸﾞﾝﾀｶﾊﾀﾏﾁ"]
[null,null,"山形県","東置賜郡川西町","ﾔﾏｶﾞﾀｹﾝ","ﾋｶﾞｼｵｷﾀﾏｸﾞﾝｶﾜﾆｼﾏﾁ"]
[null,null,"山形県","西置賜郡小国町","ﾔﾏｶﾞﾀｹﾝ","ﾆｼｵｷﾀﾏｸﾞﾝｵｸﾞﾆﾏﾁ"]
[null,null,"山形県","西置賜郡白鷹町","ﾔﾏｶﾞﾀｹﾝ","ﾆｼｵｷﾀﾏｸﾞﾝｼﾗﾀｶﾏﾁ"]
[null,null,"山形県","西置賜郡飯豊町","ﾔﾏｶﾞﾀｹﾝ","ﾆｼｵｷﾀﾏｸﾞﾝｲｲﾃﾞﾏﾁ"]
[null,null,"山形県","東田川郡三川町","ﾔﾏｶﾞﾀｹﾝ","ﾋｶﾞｼﾀｶﾞﾜｸﾞﾝﾐｶﾜﾏﾁ"]
[null,null,"山形県","東田川郡庄内町","ﾔﾏｶﾞﾀｹﾝ","ﾋｶﾞｼﾀｶﾞﾜｸﾞﾝｼｮｳﾅｲﾏﾁ"]
[null,null,"山形県","飽海郡遊佐町","ﾔﾏｶﾞﾀｹﾝ","ｱｸﾐｸﾞﾝﾕｻﾞﾏﾁ"]
[null,null,"福島県","福島市","ﾌｸｼﾏｹﾝ","ﾌｸｼﾏｼ"]
[null,null,"福島県","会津若松市","ﾌｸｼﾏｹﾝ","ｱｲﾂﾞﾜｶﾏﾂｼ"]
[null,null,"福島県","郡山市","ﾌｸｼﾏｹﾝ","ｺｵﾘﾔﾏｼ"]
[null,null,"福島県","いわき市","ﾌｸｼﾏｹﾝ","ｲﾜｷｼ"]
[null,null,"福島県","白河市","ﾌｸｼﾏｹﾝ","ｼﾗｶﾜｼ"]
[null,null,"福島県","須賀川市","ﾌｸｼﾏｹﾝ","ｽｶｶﾞﾜｼ"]
[null,null,"福島県","喜多方市","ﾌｸｼﾏｹﾝ","ｷﾀｶﾀｼ"]
[null,null,"福島県","相馬市","ﾌｸｼﾏｹﾝ","ｿｳﾏｼ"]
[null,null,"福島県","二本松市","ﾌｸｼﾏｹﾝ","ﾆﾎﾝﾏﾂｼ"]
[null,null,"福島県","田村市","ﾌｸｼﾏｹﾝ","ﾀﾑﾗｼ"]
[null,null,"福島県","南相馬市","ﾌｸｼﾏｹﾝ","ﾐﾅﾐｿｳﾏｼ"]
[null,null,"福島県","伊達市","ﾌｸｼﾏｹﾝ","ﾀﾞﾃｼ"]
[null,null,"福島県","本宮市","ﾌｸｼﾏｹﾝ","ﾓﾄﾐﾔｼ"]
[null,null,"福島県","伊達郡桑折町","ﾌｸｼﾏｹﾝ","ﾀﾞﾃｸﾞﾝｺｵﾘﾏﾁ"]
[null,null,"福島県","伊達郡国見町","ﾌｸｼﾏｹﾝ","ﾀﾞﾃｸﾞﾝｸﾆﾐﾏﾁ"]
[null,null,"福島県","伊達郡川俣町","ﾌｸｼﾏｹﾝ","ﾀﾞﾃｸﾞﾝｶﾜﾏﾀﾏﾁ"]
[null,null,"福島県","安達郡大玉村","ﾌｸｼﾏｹﾝ","ｱﾀﾞﾁｸﾞﾝｵｵﾀﾏﾑﾗ"]
[null,null,"福島県","岩瀬郡鏡石町","ﾌｸｼﾏｹﾝ","ｲﾜｾｸﾞﾝｶｶﾞﾐｲｼﾏﾁ"]
[null,null,"福島県","岩瀬郡天栄村","ﾌｸｼﾏｹﾝ","ｲﾜｾｸﾞﾝﾃﾝｴｲﾑﾗ"]
[null,null,"福島県","南会津郡下郷町","ﾌｸｼﾏｹﾝ","ﾐﾅﾐｱｲﾂﾞｸﾞﾝｼﾓｺﾞｳﾏﾁ"]
[null,null,"福島県","南会津郡檜枝岐村","ﾌｸｼﾏｹﾝ","ﾐﾅﾐｱｲﾂﾞｸﾞﾝﾋﾉｴﾏﾀﾑﾗ"]
[null,null,"福島県","南会津郡只見町","ﾌｸｼﾏｹﾝ","ﾐﾅﾐｱｲﾂﾞｸﾞﾝﾀﾀﾞﾐﾏﾁ"]
[null,null,"福島県","南会津郡南会津町","ﾌｸｼﾏｹﾝ","ﾐﾅﾐｱｲﾂﾞｸﾞﾝﾐﾅﾐｱｲﾂﾞﾏﾁ"]
[null,null,"福島県","耶麻郡北塩原村","ﾌｸｼﾏｹﾝ","ﾔﾏｸﾞﾝｷﾀｼｵﾊﾞﾗﾑﾗ"]
[null,null,"福島県","耶麻郡西会津町","ﾌｸｼﾏｹﾝ","ﾔﾏｸﾞﾝﾆｼｱｲﾂﾞﾏﾁ"]
[null,null,"福島県","耶麻郡磐梯町","ﾌｸｼﾏｹﾝ","ﾔﾏｸﾞﾝﾊﾞﾝﾀﾞｲﾏﾁ"]
[null,null,"福島県","耶麻郡猪苗代町","ﾌｸｼﾏｹﾝ","ﾔﾏｸﾞﾝｲﾅﾜｼﾛﾏﾁ"]
[null,null,"福島県","河沼郡会津坂下町","ﾌｸｼﾏｹﾝ","ｶﾜﾇﾏｸﾞﾝｱｲﾂﾞﾊﾞﾝｹﾞﾏﾁ"]
[null,null,"福島県","河沼郡湯川村","ﾌｸｼﾏｹﾝ","ｶﾜﾇﾏｸﾞﾝﾕｶﾞﾜﾑﾗ"]
[null,null,"福島県","河沼郡柳津町","ﾌｸｼﾏｹﾝ","ｶﾜﾇﾏｸﾞﾝﾔﾅｲﾂﾞﾏﾁ"]
[null,null,"福島県","大沼郡三島町","ﾌｸｼﾏｹﾝ","ｵｵﾇﾏｸﾞﾝﾐｼﾏﾏﾁ"]
[null,null,"福島県","大沼郡金山町","ﾌｸｼﾏｹﾝ","ｵｵﾇﾏｸﾞﾝｶﾈﾔﾏﾏﾁ"]
[null,null,"福島県","大沼郡昭和村","ﾌｸｼﾏｹﾝ","ｵｵﾇﾏｸﾞﾝｼｮｳﾜﾑﾗ"]
[null,null,"福島県","大沼郡会津美里町","ﾌｸｼﾏｹﾝ","ｵｵﾇﾏｸﾞﾝｱｲﾂﾞﾐｻﾄﾏﾁ"]
[null,null,"福島県","西白河郡西郷村","ﾌｸｼﾏｹﾝ","ﾆｼｼﾗｶﾜｸﾞﾝﾆｼｺﾞｳﾑﾗ"]
[null,null,"福島県","西白河郡泉崎村","ﾌｸｼﾏｹﾝ","ﾆｼｼﾗｶﾜｸﾞﾝｲｽﾞﾐｻﾞｷﾑﾗ"]
[null,null,"福島県","西白河郡中島村","ﾌｸｼﾏｹﾝ","ﾆｼｼﾗｶﾜｸﾞﾝﾅｶｼﾞﾏﾑﾗ"]
[null,null,"福島県","西白河郡矢吹町","ﾌｸｼﾏｹﾝ","ﾆｼｼﾗｶﾜｸﾞﾝﾔﾌﾞｷﾏﾁ"]
[null,null,"福島県","東白川郡棚倉町","ﾌｸｼﾏｹﾝ","ﾋｶﾞｼｼﾗｶﾜｸﾞﾝﾀﾅｸﾞﾗﾏﾁ"]
[null,null,"福島県","東白川郡矢祭町","ﾌｸｼﾏｹﾝ","ﾋｶﾞｼｼﾗｶﾜｸﾞﾝﾔﾏﾂﾘﾏﾁ"]
[null,null,"福島県","東白川郡塙町","ﾌｸｼﾏｹﾝ","ﾋｶﾞｼｼﾗｶﾜｸﾞﾝﾊﾅﾜﾏﾁ"]
[null,null,"福島県","東白川郡鮫川村","ﾌｸｼﾏｹﾝ","ﾋｶﾞｼｼﾗｶﾜｸﾞﾝｻﾒｶﾞﾜﾑﾗ"]
[null,null,"福島県","石川郡石川町","ﾌｸｼﾏｹﾝ","ｲｼｶﾜｸﾞﾝｲｼｶﾜﾏﾁ"]
[null,null,"福島県","石川郡玉川村","ﾌｸｼﾏｹﾝ","ｲｼｶﾜｸﾞﾝﾀﾏｶﾜﾑﾗ"]
[null,null,"福島県","石川郡平田村","ﾌｸｼﾏｹﾝ","ｲｼｶﾜｸﾞﾝﾋﾗﾀﾑﾗ"]
[null,null,"福島県","石川郡浅川町","ﾌｸｼﾏｹﾝ","ｲｼｶﾜｸﾞﾝｱｻｶﾜﾏﾁ"]
[null,null,"福島県","石川郡古殿町","ﾌｸｼﾏｹﾝ","ｲｼｶﾜｸﾞﾝﾌﾙﾄﾞﾉﾏﾁ"]
[null,null,"福島県","田村郡三春町","ﾌｸｼﾏｹﾝ","ﾀﾑﾗｸﾞﾝﾐﾊﾙﾏﾁ"]
[null,null,"福島県","田村郡小野町","ﾌｸｼﾏｹﾝ","ﾀﾑﾗｸﾞﾝｵﾉﾏﾁ"]
[null,null,"福島県","双葉郡広野町","ﾌｸｼﾏｹﾝ","ﾌﾀﾊﾞｸﾞﾝﾋﾛﾉﾏﾁ"]
[null,null,"福島県","双葉郡楢葉町","ﾌｸｼﾏｹﾝ","ﾌﾀﾊﾞｸﾞﾝﾅﾗﾊﾏﾁ"]
[null,null,"福島県","双葉郡富岡町","ﾌｸｼﾏｹﾝ","ﾌﾀﾊﾞｸﾞﾝﾄﾐｵｶﾏﾁ"]
[null,null,"福島県","双葉郡川内村","ﾌｸｼﾏｹﾝ","ﾌﾀﾊﾞｸﾞﾝｶﾜｳﾁﾑﾗ"]
[null,null,"福島県","双葉郡大熊町","ﾌｸｼﾏｹﾝ","ﾌﾀﾊﾞｸﾞﾝｵｵｸﾏﾏﾁ"]
[null,null,"福島県","双葉郡双葉町","ﾌｸｼﾏｹﾝ","ﾌﾀﾊﾞｸﾞﾝﾌﾀﾊﾞﾏﾁ"]
[null,null,"福島県","双葉郡浪江町","ﾌｸｼﾏｹﾝ","ﾌﾀﾊﾞｸﾞﾝﾅﾐｴﾏﾁ"]
[null,null,"福島県","双葉郡葛尾村","ﾌｸｼﾏｹﾝ","ﾌﾀﾊﾞｸﾞﾝｶﾂﾗｵﾑﾗ"]
[null,null,"福島県","相馬郡新地町","ﾌｸｼﾏｹﾝ","ｿｳﾏｸﾞﾝｼﾝﾁﾏﾁ"]
[null,null,"福島県","相馬郡飯舘村","ﾌｸｼﾏｹﾝ","ｿｳﾏｸﾞﾝｲｲﾀﾃﾑﾗ"]
[null,null,"茨城県","水戸市","ｲﾊﾞﾗｷｹﾝ","ﾐﾄｼ"]
[null,null,"茨城県","日立市","ｲﾊﾞﾗｷｹﾝ","ﾋﾀﾁｼ"]
[null,null,"茨城県","土浦市","ｲﾊﾞﾗｷｹﾝ","ﾂﾁｳﾗｼ"]
[null,null,"茨城県","古河市","ｲﾊﾞﾗｷｹﾝ","ｺｶﾞｼ"]
[null,null,"茨城県","石岡市","ｲﾊﾞﾗｷｹﾝ","ｲｼｵｶｼ"]
[null,null,"茨城県","結城市","ｲﾊﾞﾗｷｹﾝ","ﾕｳｷｼ"]
[null,null,"茨城県","龍ケ崎市","ｲﾊﾞﾗｷｹﾝ","ﾘｭｳｶﾞｻｷｼ"]
[null,null,"茨城県","下妻市","ｲﾊﾞﾗｷｹﾝ","ｼﾓﾂﾏｼ"]
[null,null,"茨城県","常総市","ｲﾊﾞﾗｷｹﾝ","ｼﾞｮｳｿｳｼ"]
[null,null,"茨城県","常陸太田市","ｲﾊﾞﾗｷｹﾝ","ﾋﾀﾁｵｵﾀｼ"]
[null,null,"茨城県","高萩市","ｲﾊﾞﾗｷｹﾝ","ﾀｶﾊｷﾞｼ"]
[null,null,"茨城県","北茨城市","ｲﾊﾞﾗｷｹﾝ","ｷﾀｲﾊﾞﾗｷｼ"]
[null,null,"茨城県","笠間市","ｲﾊﾞﾗｷｹﾝ","ｶｻﾏｼ"]
[null,null,"茨城県","取手市","ｲﾊﾞﾗｷｹﾝ","ﾄﾘﾃﾞｼ"]
[null,null,"茨城県","牛久市","ｲﾊﾞﾗｷｹﾝ","ｳｼｸｼ"]
[null,null,"茨城県","つくば市","ｲﾊﾞﾗｷｹﾝ","ﾂｸﾊﾞｼ"]
[null,null,"茨城県","ひたちなか市","ｲﾊﾞﾗｷｹﾝ","ﾋﾀﾁﾅｶｼ"]
[null,null,"茨城県","鹿嶋市","ｲﾊﾞﾗｷｹﾝ","ｶｼﾏｼ"]
[null,null,"茨城県","潮来市","ｲﾊﾞﾗｷｹﾝ","ｲﾀｺｼ"]
[null,null,"茨城県","守谷市","ｲﾊﾞﾗｷｹﾝ","ﾓﾘﾔｼ"]
[null,null,"茨城県","常陸大宮市","ｲﾊﾞﾗｷｹﾝ","ﾋﾀﾁｵｵﾐﾔｼ"]
[null,null,"茨城県","那珂市","ｲﾊﾞﾗｷｹﾝ","ﾅｶｼ"]
[null,null,"茨城県","筑西市","ｲﾊﾞﾗｷｹﾝ","ﾁｸｾｲｼ"]
[null,null,"茨城県","坂東市","ｲﾊﾞﾗｷｹﾝ","ﾊﾞﾝﾄﾞｳｼ"]
[null,null,"茨城県","稲敷市","ｲﾊﾞﾗｷｹﾝ","ｲﾅｼｷｼ"]
[null,null,"茨城県","かすみがうら市","ｲﾊﾞﾗｷｹﾝ","ｶｽﾐｶﾞｳﾗｼ"]
[null,null,"茨城県","桜川市","ｲﾊﾞﾗｷｹﾝ","ｻｸﾗｶﾞﾜｼ"]
[null,null,"茨城県","神栖市","ｲﾊﾞﾗｷｹﾝ","ｶﾐｽｼ"]
[null,null,"茨城県","行方市","ｲﾊﾞﾗｷｹﾝ","ﾅﾒｶﾞﾀｼ"]
[null,null,"茨城県","鉾田市","ｲﾊﾞﾗｷｹﾝ","ﾎｺﾀｼ"]
[null,null,"茨城県","つくばみらい市","ｲﾊﾞﾗｷｹﾝ","ﾂｸﾊﾞﾐﾗｲｼ"]
[null,null,"茨城県","小美玉市","ｲﾊﾞﾗｷｹﾝ","ｵﾐﾀﾏｼ"]
[null,null,"茨城県","東茨城郡茨城町","ｲﾊﾞﾗｷｹﾝ","ﾋｶﾞｼｲﾊﾞﾗｷｸﾞﾝｲﾊﾞﾗｷﾏﾁ"]
[null,null,"茨城県","東茨城郡大洗町","ｲﾊﾞﾗｷｹﾝ","ﾋｶﾞｼｲﾊﾞﾗｷｸﾞﾝｵｵｱﾗｲﾏﾁ"]
[null,null,"茨城県","東茨城郡城里町","ｲﾊﾞﾗｷｹﾝ","ﾋｶﾞｼｲﾊﾞﾗｷｸﾞﾝｼﾛｻﾄﾏﾁ"]
[null,null,"茨城県","那珂郡東海村","ｲﾊﾞﾗｷｹﾝ","ﾅｶｸﾞﾝﾄｳｶｲﾑﾗ"]
[null,null,"茨城県","久慈郡大子町","ｲﾊﾞﾗｷｹﾝ","ｸｼﾞｸﾞﾝﾀﾞｲｺﾞﾏﾁ"]
[null,null,"茨城県","稲敷郡美浦村","ｲﾊﾞﾗｷｹﾝ","ｲﾅｼｷｸﾞﾝﾐﾎﾑﾗ"]
[null,null,"茨城県","稲敷郡阿見町","ｲﾊﾞﾗｷｹﾝ","ｲﾅｼｷｸﾞﾝｱﾐﾏﾁ"]
[null,null,"茨城県","稲敷郡河内町","ｲﾊﾞﾗｷｹﾝ","ｲﾅｼｷｸﾞﾝｶﾜﾁﾏﾁ"]
[null,null,"茨城県","結城郡八千代町","ｲﾊﾞﾗｷｹﾝ","ﾕｳｷｸﾞﾝﾔﾁﾖﾏﾁ"]
[null,null,"茨城県","猿島郡五霞町","ｲﾊﾞﾗｷｹﾝ","ｻｼﾏｸﾞﾝｺﾞｶﾏﾁ"]
[null,null,"茨城県","猿島郡境町","ｲﾊﾞﾗｷｹﾝ","ｻｼﾏｸﾞﾝｻｶｲﾏﾁ"]
[null,null,"茨城県","北相馬郡利根町","ｲﾊﾞﾗｷｹﾝ","ｷﾀｿｳﾏｸﾞﾝﾄﾈﾏﾁ"]
[null,null,"栃木県","宇都宮市","ﾄﾁｷﾞｹﾝ","ｳﾂﾉﾐﾔｼ"]
[null,null,"栃木県","足利市","ﾄﾁｷﾞｹﾝ","ｱｼｶｶﾞｼ"]
[null,null,"栃木県","栃木市","ﾄﾁｷﾞｹﾝ","ﾄﾁｷﾞｼ"]
[null,null,"栃木県","佐野市","ﾄﾁｷﾞｹﾝ","ｻﾉｼ"]
[null,null,"栃木県","鹿沼市","ﾄﾁｷﾞｹﾝ","ｶﾇﾏｼ"]
[null,null,"栃木県","日光市","ﾄﾁｷﾞｹﾝ","ﾆｯｺｳｼ"]
[null,null,"栃木県","小山市","ﾄﾁｷﾞｹﾝ","ｵﾔﾏｼ"]
[null,null,"栃木県","真岡市","ﾄﾁｷﾞｹﾝ","ﾓｵｶｼ"]
[null,null,"栃木県","大田原市","ﾄﾁｷﾞｹﾝ","ｵｵﾀﾜﾗｼ"]
[null,null,"栃木県","矢板市","ﾄﾁｷﾞｹﾝ","ﾔｲﾀｼ"]
[null,null,"栃木県","那須塩原市","ﾄﾁｷﾞｹﾝ","ﾅｽｼｵﾊﾞﾗｼ"]
[null,null,"栃木県","さくら市","ﾄﾁｷﾞｹﾝ","ｻｸﾗｼ"]
[null,null,"栃木県","那須烏山市","ﾄﾁｷﾞｹﾝ","ﾅｽｶﾗｽﾔﾏｼ"]
[null,null,"栃木県","下野市","ﾄﾁｷﾞｹﾝ","ｼﾓﾂｹｼ"]
[null,null,"栃木県","河内郡上三川町","ﾄﾁｷﾞｹﾝ","ｶﾜﾁｸﾞﾝｶﾐﾉｶﾜﾏﾁ"]
[null,null,"栃木県","芳賀郡益子町","ﾄﾁｷﾞｹﾝ","ﾊｶﾞｸﾞﾝﾏｼｺﾏﾁ"]
[null,null,"栃木県","芳賀郡茂木町","ﾄﾁｷﾞｹﾝ","ﾊｶﾞｸﾞﾝﾓﾃｷﾞﾏﾁ"]
[null,null,"栃木県","芳賀郡市貝町","ﾄﾁｷﾞｹﾝ","ﾊｶﾞｸﾞﾝｲﾁｶｲﾏﾁ"]
[null,null,"栃木県","芳賀郡芳賀町","ﾄﾁｷﾞｹﾝ","ﾊｶﾞｸﾞﾝﾊｶﾞﾏﾁ"]
[null,null,"栃木県","下都賀郡壬生町","ﾄﾁｷﾞｹﾝ","ｼﾓﾂｶﾞｸﾞﾝﾐﾌﾞﾏﾁ"]
[null,null,"栃木県","下都賀郡野木町","ﾄﾁｷﾞｹﾝ","ｼﾓﾂｶﾞｸﾞﾝﾉｷﾞﾏﾁ"]
[null,null,"栃木県","塩谷郡塩谷町","ﾄﾁｷﾞｹﾝ","ｼｵﾔｸﾞﾝｼｵﾔﾏﾁ"]
[null,null,"栃木県","塩谷郡高根沢町","ﾄﾁｷﾞｹﾝ","ｼｵﾔｸﾞﾝﾀｶﾈｻﾞﾜﾏﾁ"]
[null,null,"栃木県","那須郡那須町","ﾄﾁｷﾞｹﾝ","ﾅｽｸﾞﾝﾅｽﾏﾁ"]
[null,null,"栃木県","那須郡那珂川町","ﾄﾁｷﾞｹﾝ","ﾅｽｸﾞﾝﾅｶｶﾞﾜﾏﾁ"]
[null,null,"群馬県","前橋市","ｸﾞﾝﾏｹﾝ","ﾏｴﾊﾞｼｼ"]
[null,null,"群馬県","高崎市","ｸﾞﾝﾏｹﾝ","ﾀｶｻｷｼ"]
[null,null,"群馬県","桐生市","ｸﾞﾝﾏｹﾝ","ｷﾘｭｳｼ"]
[null,null,"群馬県","伊勢崎市","ｸﾞﾝﾏｹﾝ","ｲｾｻｷｼ"]
[null,null,"群馬県","太田市","ｸﾞﾝﾏｹﾝ","ｵｵﾀｼ"]
[null,null,"群馬県","沼田市","ｸﾞﾝﾏｹﾝ","ﾇﾏﾀｼ"]
[null,null,"群馬県","館林市","ｸﾞﾝﾏｹﾝ","ﾀﾃﾊﾞﾔｼｼ"]
[null,null,"群馬県","渋川市","ｸﾞﾝﾏｹﾝ","ｼﾌﾞｶﾜｼ"]
[null,null,"群馬県","藤岡市","ｸﾞﾝﾏｹﾝ","ﾌｼﾞｵｶｼ"]
[null,null,"群馬県","富岡市","ｸﾞﾝﾏｹﾝ","ﾄﾐｵｶｼ"]
[null,null,"群馬県","安中市","ｸﾞﾝﾏｹﾝ","ｱﾝﾅｶｼ"]
[null,null,"群馬県","みどり市","ｸﾞﾝﾏｹﾝ","ﾐﾄﾞﾘｼ"]
[null,null,"群馬県","北群馬郡榛東村","ｸﾞﾝﾏｹﾝ","ｷﾀｸﾞﾝﾏｸﾞﾝｼﾝﾄｳﾑﾗ"]
[null,null,"群馬県","北群馬郡吉岡町","ｸﾞﾝﾏｹﾝ","ｷﾀｸﾞﾝﾏｸﾞﾝﾖｼｵｶﾏﾁ"]
[null,null,"群馬県","多野郡上野村","ｸﾞﾝﾏｹﾝ","ﾀﾉｸﾞﾝｳｴﾉﾑﾗ"]
[null,null,"群馬県","多野郡神流町","ｸﾞﾝﾏｹﾝ","ﾀﾉｸﾞﾝｶﾝﾅﾏﾁ"]
[null,null,"群馬県","甘楽郡下仁田町","ｸﾞﾝﾏｹﾝ","ｶﾝﾗｸﾞﾝｼﾓﾆﾀﾏﾁ"]
[null,null,"群馬県","甘楽郡南牧村","ｸﾞﾝﾏｹﾝ","ｶﾝﾗｸﾞﾝﾅﾝﾓｸﾑﾗ"]
[null,null,"群馬県","甘楽郡甘楽町","ｸﾞﾝﾏｹﾝ","ｶﾝﾗｸﾞﾝｶﾝﾗﾏﾁ"]
[null,null,"群馬県","吾妻郡中之条町","ｸﾞﾝﾏｹﾝ","ｱｶﾞﾂﾏｸﾞﾝﾅｶﾉｼﾞｮｳﾏﾁ"]
[null,null,"群馬県","吾妻郡長野原町","ｸﾞﾝﾏｹﾝ","ｱｶﾞﾂﾏｸﾞﾝﾅｶﾞﾉﾊﾗﾏﾁ"]
[null,null,"群馬県","吾妻郡嬬恋村","ｸﾞﾝﾏｹﾝ","ｱｶﾞﾂﾏｸﾞﾝﾂﾏｺﾞｲﾑﾗ"]
[null,null,"群馬県","吾妻郡草津町","ｸﾞﾝﾏｹﾝ","ｱｶﾞﾂﾏｸﾞﾝｸｻﾂﾏﾁ"]
[null,null,"群馬県","吾妻郡高山村","ｸﾞﾝﾏｹﾝ","ｱｶﾞﾂﾏｸﾞﾝﾀｶﾔﾏﾑﾗ"]
[null,null,"群馬県","吾妻郡東吾妻町","ｸﾞﾝﾏｹﾝ","ｱｶﾞﾂﾏｸﾞﾝﾋｶﾞｼｱｶﾞﾂﾏﾏﾁ"]
[null,null,"群馬県","利根郡片品村","ｸﾞﾝﾏｹﾝ","ﾄﾈｸﾞﾝｶﾀｼﾅﾑﾗ"]
[null,null,"群馬県","利根郡川場村","ｸﾞﾝﾏｹﾝ","ﾄﾈｸﾞﾝｶﾜﾊﾞﾑﾗ"]
[null,null,"群馬県","利根郡昭和村","ｸﾞﾝﾏｹﾝ","ﾄﾈｸﾞﾝｼｮｳﾜﾑﾗ"]
[null,null,"群馬県","利根郡みなかみ町","ｸﾞﾝﾏｹﾝ","ﾄﾈｸﾞﾝﾐﾅｶﾐﾏﾁ"]
[null,null,"群馬県","佐波郡玉村町","ｸﾞﾝﾏｹﾝ","ｻﾜｸﾞﾝﾀﾏﾑﾗﾏﾁ"]
[null,null,"群馬県","邑楽郡板倉町","ｸﾞﾝﾏｹﾝ","ｵｳﾗｸﾞﾝｲﾀｸﾗﾏﾁ"]
[null,null,"群馬県","邑楽郡明和町","ｸﾞﾝﾏｹﾝ","ｵｳﾗｸﾞﾝﾒｲﾜﾏﾁ"]
[null,null,"群馬県","邑楽郡千代田町","ｸﾞﾝﾏｹﾝ","ｵｳﾗｸﾞﾝﾁﾖﾀﾞﾏﾁ"]
[null,null,"群馬県","邑楽郡大泉町","ｸﾞﾝﾏｹﾝ","ｵｳﾗｸﾞﾝｵｵｲｽﾞﾐﾏﾁ"]
[null,null,"群馬県","邑楽郡邑楽町","ｸﾞﾝﾏｹﾝ","ｵｳﾗｸﾞﾝｵｳﾗﾏﾁ"]
[null,null,"埼玉県","さいたま市西区","ｻｲﾀﾏｹﾝ","ｻｲﾀﾏｼﾆｼｸ"]
[null,null,"埼玉県","さいたま市北区","ｻｲﾀﾏｹﾝ","ｻｲﾀﾏｼｷﾀｸ"]
[null,null,"埼玉県","さいたま市大宮区","ｻｲﾀﾏｹﾝ","ｻｲﾀﾏｼｵｵﾐﾔｸ"]
[null,null,"埼玉県","さいたま市見沼区","ｻｲﾀﾏｹﾝ","ｻｲﾀﾏｼﾐﾇﾏｸ"]
[null,null,"埼玉県","さいたま市中央区","ｻｲﾀﾏｹﾝ","ｻｲﾀﾏｼﾁｭｳｵｳｸ"]
[null,null,"埼玉県","さいたま市桜区","ｻｲﾀﾏｹﾝ","ｻｲﾀﾏｼｻｸﾗｸ"]
[null,null,"埼玉県","さいたま市浦和区","ｻｲﾀﾏｹﾝ","ｻｲﾀﾏｼｳﾗﾜｸ"]
[null,null,"埼玉県","さいたま市南区","ｻｲﾀﾏｹﾝ","ｻｲﾀﾏｼﾐﾅﾐｸ"]
[null,null,"埼玉県","さいたま市緑区","ｻｲﾀﾏｹﾝ","ｻｲﾀﾏｼﾐﾄﾞﾘｸ"]
[null,null,"埼玉県","さいたま市岩槻区","ｻｲﾀﾏｹﾝ","ｻｲﾀﾏｼｲﾜﾂｷｸ"]
[null,null,"埼玉県","川越市","ｻｲﾀﾏｹﾝ","ｶﾜｺﾞｴｼ"]
[null,null,"埼玉県","熊谷市","ｻｲﾀﾏｹﾝ","ｸﾏｶﾞﾔｼ"]
[null,null,"埼玉県","川口市","ｻｲﾀﾏｹﾝ","ｶﾜｸﾞﾁｼ"]
[null,null,"埼玉県","行田市","ｻｲﾀﾏｹﾝ","ｷﾞｮｳﾀﾞｼ"]
[null,null,"埼玉県","秩父市","ｻｲﾀﾏｹﾝ","ﾁﾁﾌﾞｼ"]
[null,null,"埼玉県","所沢市","ｻｲﾀﾏｹﾝ","ﾄｺﾛｻﾞﾜｼ"]
[null,null,"埼玉県","飯能市","ｻｲﾀﾏｹﾝ","ﾊﾝﾉｳｼ"]
[null,null,"埼玉県","加須市","ｻｲﾀﾏｹﾝ","ｶｿﾞｼ"]
[null,null,"埼玉県","本庄市","ｻｲﾀﾏｹﾝ","ﾎﾝｼﾞｮｳｼ"]
[null,null,"埼玉県","東松山市","ｻｲﾀﾏｹﾝ","ﾋｶﾞｼﾏﾂﾔﾏｼ"]
[null,null,"埼玉県","春日部市","ｻｲﾀﾏｹﾝ","ｶｽｶﾍﾞｼ"]
[null,null,"埼玉県","狭山市","ｻｲﾀﾏｹﾝ","ｻﾔﾏｼ"]
[null,null,"埼玉県","羽生市","ｻｲﾀﾏｹﾝ","ﾊﾆｭｳｼ"]
[null,null,"埼玉県","鴻巣市","ｻｲﾀﾏｹﾝ","ｺｳﾉｽｼ"]
[null,null,"埼玉県","深谷市","ｻｲﾀﾏｹﾝ","ﾌｶﾔｼ"]
[null,null,"埼玉県","上尾市","ｻｲﾀﾏｹﾝ","ｱｹﾞｵｼ"]
[null,null,"埼玉県","草加市","ｻｲﾀﾏｹﾝ","ｿｳｶｼ"]
[null,null,"埼玉県","越谷市","ｻｲﾀﾏｹﾝ","ｺｼｶﾞﾔｼ"]
[null,null,"埼玉県","蕨市","ｻｲﾀﾏｹﾝ","ﾜﾗﾋﾞｼ"]
[null,null,"埼玉県","戸田市","ｻｲﾀﾏｹﾝ","ﾄﾀﾞｼ"]
[null,null,"埼玉県","入間市","ｻｲﾀﾏｹﾝ","ｲﾙﾏｼ"]
[null,null,"埼玉県","朝霞市","ｻｲﾀﾏｹﾝ","ｱｻｶｼ"]
[null,null,"埼玉県","志木市","ｻｲﾀﾏｹﾝ","ｼｷｼ"]
[null,null,"埼玉県","和光市","ｻｲﾀﾏｹﾝ","ﾜｺｳｼ"]
[null,null,"埼玉県","新座市","ｻｲﾀﾏｹﾝ","ﾆｲｻﾞｼ"]
[null,null,"埼玉県","桶川市","ｻｲﾀﾏｹﾝ","ｵｹｶﾞﾜｼ"]
[null,null,"埼玉県","久喜市","ｻｲﾀﾏｹﾝ","ｸｷｼ"]
[null,null,"埼玉県","北本市","ｻｲﾀﾏｹﾝ","ｷﾀﾓﾄｼ"]
[null,null,"埼玉県","八潮市","ｻｲﾀﾏｹﾝ","ﾔｼｵｼ"]
[null,null,"埼玉県","富士見市","ｻｲﾀﾏｹﾝ","ﾌｼﾞﾐｼ"]
[null,null,"埼玉県","三郷市","ｻｲﾀﾏｹﾝ","ﾐｻﾄｼ"]
[null,null,"埼玉県","蓮田市","ｻｲﾀﾏｹﾝ","ﾊｽﾀﾞｼ"]
[null,null,"埼玉県","坂戸市","ｻｲﾀﾏｹﾝ","ｻｶﾄﾞｼ"]
[null,null,"埼玉県","幸手市","ｻｲﾀﾏｹﾝ","ｻｯﾃｼ"]
[null,null,"埼玉県","鶴ヶ島市","ｻｲﾀﾏｹﾝ","ﾂﾙｶﾞｼﾏｼ"]
[null,null,"埼玉県","日高市","ｻｲﾀﾏｹﾝ","ﾋﾀﾞｶｼ"]
[null,null,"埼玉県","吉川市","ｻｲﾀﾏｹﾝ","ﾖｼｶﾜｼ"]
[null,null,"埼玉県","ふじみ野市","ｻｲﾀﾏｹﾝ","ﾌｼﾞﾐﾉｼ"]
[null,null,"埼玉県","白岡市","ｻｲﾀﾏｹﾝ","ｼﾗｵｶｼ"]
[null,null,"埼玉県","北足立郡伊奈町","ｻｲﾀﾏｹﾝ","ｷﾀｱﾀﾞﾁｸﾞﾝｲﾅﾏﾁ"]
[null,null,"埼玉県","入間郡三芳町","ｻｲﾀﾏｹﾝ","ｲﾙﾏｸﾞﾝﾐﾖｼﾏﾁ"]
[null,null,"埼玉県","入間郡毛呂山町","ｻｲﾀﾏｹﾝ","ｲﾙﾏｸﾞﾝﾓﾛﾔﾏﾏﾁ"]
[null,null,"埼玉県","入間郡越生町","ｻｲﾀﾏｹﾝ","ｲﾙﾏｸﾞﾝｵｺﾞｾﾏﾁ"]
[null,null,"埼玉県","比企郡滑川町","ｻｲﾀﾏｹﾝ","ﾋｷｸﾞﾝﾅﾒｶﾞﾜﾏﾁ"]
[null,null,"埼玉県","比企郡嵐山町","ｻｲﾀﾏｹﾝ","ﾋｷｸﾞﾝﾗﾝｻﾞﾝﾏﾁ"]
[null,null,"埼玉県","比企郡小川町","ｻｲﾀﾏｹﾝ","ﾋｷｸﾞﾝｵｶﾞﾜﾏﾁ"]
[null,null,"埼玉県","比企郡川島町","ｻｲﾀﾏｹﾝ","ﾋｷｸﾞﾝｶﾜｼﾞﾏﾏﾁ"]
[null,null,"埼玉県","比企郡吉見町","ｻｲﾀﾏｹﾝ","ﾋｷｸﾞﾝﾖｼﾐﾏﾁ"]
[null,null,"埼玉県","比企郡鳩山町","ｻｲﾀﾏｹﾝ","ﾋｷｸﾞﾝﾊﾄﾔﾏﾏﾁ"]
[null,null,"埼玉県","比企郡ときがわ町","ｻｲﾀﾏｹﾝ","ﾋｷｸﾞﾝﾄｷｶﾞﾜﾏﾁ"]
[null,null,"埼玉県","秩父郡横瀬町","ｻｲﾀﾏｹﾝ","ﾁﾁﾌﾞｸﾞﾝﾖｺｾﾞﾏﾁ"]
[null,null,"埼玉県","秩父郡皆野町","ｻｲﾀﾏｹﾝ","ﾁﾁﾌﾞｸﾞﾝﾐﾅﾉﾏﾁ"]
[null,null,"埼玉県","秩父郡長瀞町","ｻｲﾀﾏｹﾝ","ﾁﾁﾌﾞｸﾞﾝﾅｶﾞﾄﾛﾏﾁ"]
[null,null,"埼玉県","秩父郡小鹿野町","ｻｲﾀﾏｹﾝ","ﾁﾁﾌﾞｸﾞﾝｵｶﾞﾉﾏﾁ"]
[null,null,"埼玉県","秩父郡東秩父村","ｻｲﾀﾏｹﾝ","ﾁﾁﾌﾞｸﾞﾝﾋｶﾞｼﾁﾁﾌﾞﾑﾗ"]
[null,null,"埼玉県","児玉郡美里町","ｻｲﾀﾏｹﾝ","ｺﾀﾞﾏｸﾞﾝﾐｻﾄﾏﾁ"]
[null,null,"埼玉県","児玉郡神川町","ｻｲﾀﾏｹﾝ","ｺﾀﾞﾏｸﾞﾝｶﾐｶﾜﾏﾁ"]
[null,null,"埼玉県","児玉郡上里町","ｻｲﾀﾏｹﾝ","ｺﾀﾞﾏｸﾞﾝｶﾐｻﾄﾏﾁ"]
[null,null,"埼玉県","大里郡寄居町","ｻｲﾀﾏｹﾝ","ｵｵｻﾄｸﾞﾝﾖﾘｲﾏﾁ"]
[null,null,"埼玉県","南埼玉郡宮代町","ｻｲﾀﾏｹﾝ","ﾐﾅﾐｻｲﾀﾏｸﾞﾝﾐﾔｼﾛﾏﾁ"]
[null,null,"埼玉県","北葛飾郡杉戸町","ｻｲﾀﾏｹﾝ","ｷﾀｶﾂｼｶｸﾞﾝｽｷﾞﾄﾏﾁ"]
[null,null,"埼玉県","北葛飾郡松伏町","ｻｲﾀﾏｹﾝ","ｷﾀｶﾂｼｶｸﾞﾝﾏﾂﾌﾞｼﾏﾁ"]
[null,null,"千葉県","千葉市中央区","ﾁﾊﾞｹﾝ","ﾁﾊﾞｼﾁｭｳｵｳｸ"]
[null,null,"千葉県","千葉市花見川区","ﾁﾊﾞｹﾝ","ﾁﾊﾞｼﾊﾅﾐｶﾞﾜｸ"]
[null,null,"千葉県","千葉市稲毛区","ﾁﾊﾞｹﾝ","ﾁﾊﾞｼｲﾅｹﾞｸ"]
[null,null,"千葉県","千葉市若葉区","ﾁﾊﾞｹﾝ","ﾁﾊﾞｼﾜｶﾊﾞｸ"]
[null,null,"千葉県","千葉市緑区","ﾁﾊﾞｹﾝ","ﾁﾊﾞｼﾐﾄﾞﾘｸ"]
[null,null,"千葉県","千葉市美浜区","ﾁﾊﾞｹﾝ","ﾁﾊﾞｼﾐﾊﾏｸ"]
[null,null,"千葉県","銚子市","ﾁﾊﾞｹﾝ","ﾁｮｳｼｼ"]
[null,null,"千葉県","市川市","ﾁﾊﾞｹﾝ","ｲﾁｶﾜｼ"]
[null,null,"千葉県","船橋市","ﾁﾊﾞｹﾝ","ﾌﾅﾊﾞｼｼ"]
[null,null,"千葉県","館山市","ﾁﾊﾞｹﾝ","ﾀﾃﾔﾏｼ"]
[null,null,"千葉県","木更津市","ﾁﾊﾞｹﾝ","ｷｻﾗﾂﾞｼ"]
[null,null,"千葉県","松戸市","ﾁﾊﾞｹﾝ","ﾏﾂﾄﾞｼ"]
[null,null,"千葉県","野田市","ﾁﾊﾞｹﾝ","ﾉﾀﾞｼ"]
[null,null,"千葉県","茂原市","ﾁﾊﾞｹﾝ","ﾓﾊﾞﾗｼ"]
[null,null,"千葉県","成田市","ﾁﾊﾞｹﾝ","ﾅﾘﾀｼ"]
[null,null,"千葉県","佐倉市","ﾁﾊﾞｹﾝ","ｻｸﾗｼ"]
[null,null,"千葉県","東金市","ﾁﾊﾞｹﾝ","ﾄｳｶﾞﾈｼ"]
[null,null,"千葉県","旭市","ﾁﾊﾞｹﾝ","ｱｻﾋｼ"]
[null,null,"千葉県","習志野市","ﾁﾊﾞｹﾝ","ﾅﾗｼﾉｼ"]
[null,null,"千葉県","柏市","ﾁﾊﾞｹﾝ","ｶｼﾜｼ"]
[null,null,"千葉県","勝浦市","ﾁﾊﾞｹﾝ","ｶﾂｳﾗｼ"]
[null,null,"千葉県","市原市","ﾁﾊﾞｹﾝ","ｲﾁﾊﾗｼ"]
[null,null,"千葉県","流山市","ﾁﾊﾞｹﾝ","ﾅｶﾞﾚﾔﾏｼ"]
[null,null,"千葉県","八千代市","ﾁﾊﾞｹﾝ","ﾔﾁﾖｼ"]
[null,null,"千葉県","我孫子市","ﾁﾊﾞｹﾝ","ｱﾋﾞｺｼ"]
[null,null,"千葉県","鴨川市","ﾁﾊﾞｹﾝ","ｶﾓｶﾞﾜｼ"]
[null,null,"千葉県","鎌ケ谷市","ﾁﾊﾞｹﾝ","ｶﾏｶﾞﾔｼ"]
[null,null,"千葉県","君津市","ﾁﾊﾞｹﾝ","ｷﾐﾂｼ"]
[null,null,"千葉県","富津市","ﾁﾊﾞｹﾝ","ﾌｯﾂｼ"]
[null,null,"千葉県","浦安市","ﾁﾊﾞｹﾝ","ｳﾗﾔｽｼ"]
[null,null,"千葉県","四街道市","ﾁﾊﾞｹﾝ","ﾖﾂｶｲﾄﾞｳｼ"]
[null,null,"千葉県","袖ケ浦市","ﾁﾊﾞｹﾝ","ｿﾃﾞｶﾞｳﾗｼ"]
[null,null,"千葉県","八街市","ﾁﾊﾞｹﾝ","ﾔﾁﾏﾀｼ"]
[null,null,"千葉県","印西市","ﾁﾊﾞｹﾝ","ｲﾝｻﾞｲｼ"]
[null,null,"千葉県","白井市","ﾁﾊﾞｹﾝ","ｼﾛｲｼ"]
[null,null,"千葉県","富里市","ﾁﾊﾞｹﾝ","ﾄﾐｻﾄｼ"]
[null,null,"千葉県","南房総市","ﾁﾊﾞｹﾝ","ﾐﾅﾐﾎﾞｳｿｳｼ"]
[null,null,"千葉県","匝瑳市","ﾁﾊﾞｹﾝ","ｿｳｻｼ"]
[null,null,"千葉県","香取市","ﾁﾊﾞｹﾝ","ｶﾄﾘｼ"]
[null,null,"千葉県","山武市","ﾁﾊﾞｹﾝ","ｻﾝﾑｼ"]
[null,null,"千葉県","いすみ市","ﾁﾊﾞｹﾝ","ｲｽﾐｼ"]
[null,null,"千葉県","大網白里市","ﾁﾊﾞｹﾝ","ｵｵｱﾐｼﾗｻﾄｼ"]
[null,null,"千葉県","印旛郡酒々井町","ﾁﾊﾞｹﾝ","ｲﾝﾊﾞｸﾞﾝｼｽｲﾏﾁ"]
[null,null,"千葉県","印旛郡栄町","ﾁﾊﾞｹﾝ","ｲﾝﾊﾞｸﾞﾝｻｶｴﾏﾁ"]
[null,null,"千葉県","香取郡神崎町","ﾁﾊﾞｹﾝ","ｶﾄﾘｸﾞﾝｺｳｻﾞｷﾏﾁ"]
[null,null,"千葉県","香取郡多古町","ﾁﾊﾞｹﾝ","ｶﾄﾘｸﾞﾝﾀｺﾏﾁ"]
[null,null,"千葉県","香取郡東庄町","ﾁﾊﾞｹﾝ","ｶﾄﾘｸﾞﾝﾄｳﾉｼｮｳﾏﾁ"]
[null,null,"千葉県","山武郡九十九里町","ﾁﾊﾞｹﾝ","ｻﾝﾌﾞｸﾞﾝｸｼﾞｭｳｸﾘﾏﾁ"]
[null,null,"千葉県","山武郡芝山町","ﾁﾊﾞｹﾝ","ｻﾝﾌﾞｸﾞﾝｼﾊﾞﾔﾏﾏﾁ"]
[null,null,"千葉県","山武郡横芝光町","ﾁﾊﾞｹﾝ","ｻﾝﾌﾞｸﾞﾝﾖｺｼﾊﾞﾋｶﾘﾏﾁ"]
[null,null,"千葉県","長生郡一宮町","ﾁﾊﾞｹﾝ","ﾁｮｳｾｲｸﾞﾝｲﾁﾉﾐﾔﾏﾁ"]
[null,null,"千葉県","長生郡睦沢町","ﾁﾊﾞｹﾝ","ﾁｮｳｾｲｸﾞﾝﾑﾂｻﾞﾜﾏﾁ"]
[null,null,"千葉県","長生郡長生村","ﾁﾊﾞｹﾝ","ﾁｮｳｾｲｸﾞﾝﾁｮｳｾｲﾑﾗ"]
[null,null,"千葉県","長生郡白子町","ﾁﾊﾞｹﾝ","ﾁｮｳｾｲｸﾞﾝｼﾗｺﾏﾁ"]
[null,null,"千葉県","長生郡長柄町","ﾁﾊﾞｹﾝ","ﾁｮｳｾｲｸﾞﾝﾅｶﾞﾗﾏﾁ"]
[null,null,"千葉県","長生郡長南町","ﾁﾊﾞｹﾝ","ﾁｮｳｾｲｸﾞﾝﾁｮｳﾅﾝﾏﾁ"]
[null,null,"千葉県","夷隅郡大多喜町","ﾁﾊﾞｹﾝ","ｲｽﾐｸﾞﾝｵｵﾀｷﾏﾁ"]
[null,null,"千葉県","夷隅郡御宿町","ﾁﾊﾞｹﾝ","ｲｽﾐｸﾞﾝｵﾝｼﾞｭｸﾏﾁ"]
[null,null,"千葉県","安房郡鋸南町","ﾁﾊﾞｹﾝ","ｱﾜｸﾞﾝｷｮﾅﾝﾏﾁ"]
[null,null,"東京都","千代田区","ﾄｳｷｮｳﾄ","ﾁﾖﾀﾞｸ"]
[null,null,"東京都","中央区","ﾄｳｷｮｳﾄ","ﾁｭｳｵｳｸ"]
[null,null,"東京都","港区","ﾄｳｷｮｳﾄ","ﾐﾅﾄｸ"]
[null,null,"東京都","新宿区","ﾄｳｷｮｳﾄ","ｼﾝｼﾞｭｸｸ"]
[null,null,"東京都","文京区","ﾄｳｷｮｳﾄ","ﾌﾞﾝｷｮｳｸ"]
[null,null,"東京都","台東区","ﾄｳｷｮｳﾄ","ﾀｲﾄｳｸ"]
[null,null,"東京都","墨田区","ﾄｳｷｮｳﾄ","ｽﾐﾀﾞｸ"]
[null,null,"東京都","江東区","ﾄｳｷｮｳﾄ","ｺｳﾄｳｸ"]
[null,null,"東京都","品川区","ﾄｳｷｮｳﾄ","ｼﾅｶﾞﾜｸ"]
[null,null,"東京都","目黒区","ﾄｳｷｮｳﾄ","ﾒｸﾞﾛｸ"]
[null,null,"東京都","大田区","ﾄｳｷｮｳﾄ","ｵｵﾀｸ"]
[null,null,"東京都","世田谷区","ﾄｳｷｮｳﾄ","ｾﾀｶﾞﾔｸ"]
[null,null,"東京都","渋谷区","ﾄｳｷｮｳﾄ","ｼﾌﾞﾔｸ"]
[null,null,"東京都","中野区","ﾄｳｷｮｳﾄ","ﾅｶﾉｸ"]
[null,null,"東京都","杉並区","ﾄｳｷｮｳﾄ","ｽｷﾞﾅﾐｸ"]
[null,null,"東京都","豊島区","ﾄｳｷｮｳﾄ","ﾄｼﾏｸ"]
[null,null,"東京都","北区","ﾄｳｷｮｳﾄ","ｷﾀｸ"]
[null,null,"東京都","荒川区","ﾄｳｷｮｳﾄ","ｱﾗｶﾜｸ"]
[null,null,"東京都","板橋区","ﾄｳｷｮｳﾄ","ｲﾀﾊﾞｼｸ"]
[null,null,"東京都","練馬区","ﾄｳｷｮｳﾄ","ﾈﾘﾏｸ"]
[null,null,"東京都","足立区","ﾄｳｷｮｳﾄ","ｱﾀﾞﾁｸ"]
[null,null,"東京都","葛飾区","ﾄｳｷｮｳﾄ","ｶﾂｼｶｸ"]
[null,null,"東京都","江戸川区","ﾄｳｷｮｳﾄ","ｴﾄﾞｶﾞﾜｸ"]
[null,null,"東京都","八王子市","ﾄｳｷｮｳﾄ","ﾊﾁｵｳｼﾞｼ"]
[null,null,"東京都","立川市","ﾄｳｷｮｳﾄ","ﾀﾁｶﾜｼ"]
[null,null,"東京都","武蔵野市","ﾄｳｷｮｳﾄ","ﾑｻｼﾉｼ"]
[null,null,"東京都","三鷹市","ﾄｳｷｮｳﾄ","ﾐﾀｶｼ"]
[null,null,"東京都","青梅市","ﾄｳｷｮｳﾄ","ｵｳﾒｼ"]
[null,null,"東京都","府中市","ﾄｳｷｮｳﾄ","ﾌﾁｭｳｼ"]
[null,null,"東京都","昭島市","ﾄｳｷｮｳﾄ","ｱｷｼﾏｼ"]
[null,null,"東京都","調布市","ﾄｳｷｮｳﾄ","ﾁｮｳﾌｼ"]
[null,null,"東京都","町田市","ﾄｳｷｮｳﾄ","ﾏﾁﾀﾞｼ"]
[null,null,"東京都","小金井市","ﾄｳｷｮｳﾄ","ｺｶﾞﾈｲｼ"]
[null,null,"東京都","小平市","ﾄｳｷｮｳﾄ","ｺﾀﾞｲﾗｼ"]
[null,null,"東京都","日野市","ﾄｳｷｮｳﾄ","ﾋﾉｼ"]
[null,null,"東京都","東村山市","ﾄｳｷｮｳﾄ","ﾋｶﾞｼﾑﾗﾔﾏｼ"]
[null,null,"東京都","国分寺市","ﾄｳｷｮｳﾄ","ｺｸﾌﾞﾝｼﾞｼ"]
[null,null,"東京都","国立市","ﾄｳｷｮｳﾄ","ｸﾆﾀﾁｼ"]
[null,null,"東京都","福生市","ﾄｳｷｮｳﾄ","ﾌｯｻｼ"]
[null,null,"東京都","狛江市","ﾄｳｷｮｳﾄ","ｺﾏｴｼ"]
[null,null,"東京都","東大和市","ﾄｳｷｮｳﾄ","ﾋｶﾞｼﾔﾏﾄｼ"]
[null,null,"東京都","清瀬市","ﾄｳｷｮｳﾄ","ｷﾖｾｼ"]
[null,null,"東京都","東久留米市","ﾄｳｷｮｳﾄ","ﾋｶﾞｼｸﾙﾒｼ"]
[null,null,"東京都","武蔵村山市","ﾄｳｷｮｳﾄ","ﾑｻｼﾑﾗﾔﾏｼ"]
[null,null,"東京都","多摩市","ﾄｳｷｮｳﾄ","ﾀﾏｼ"]
[null,null,"東京都","稲城市","ﾄｳｷｮｳﾄ","ｲﾅｷﾞｼ"]
[null,null,"東京都","羽村市","ﾄｳｷｮｳﾄ","ﾊﾑﾗｼ"]
[null,null,"東京都","あきる野市","ﾄｳｷｮｳﾄ","ｱｷﾙﾉｼ"]
[null,null,"東京都","西東京市","ﾄｳｷｮｳﾄ","ﾆｼﾄｳｷｮｳｼ"]
[null,null,"東京都","西多摩郡瑞穂町","ﾄｳｷｮｳﾄ","ﾆｼﾀﾏｸﾞﾝﾐｽﾞﾎﾏﾁ"]
[null,null,"東京都","西多摩郡日の出町","ﾄｳｷｮｳﾄ","ﾆｼﾀﾏｸﾞﾝﾋﾉﾃﾞﾏﾁ"]
[null,null,"東京都","西多摩郡檜原村","ﾄｳｷｮｳﾄ","ﾆｼﾀﾏｸﾞﾝﾋﾉﾊﾗﾑﾗ"]
[null,null,"東京都","西多摩郡奥多摩町","ﾄｳｷｮｳﾄ","ﾆｼﾀﾏｸﾞﾝｵｸﾀﾏﾏﾁ"]
[null,null,"東京都","大島町","ﾄｳｷｮｳﾄ","ｵｵｼﾏﾏﾁ"]
[null,null,"東京都","利島村","ﾄｳｷｮｳﾄ","ﾄｼﾏﾑﾗ"]
[null,null,"東京都","新島村","ﾄｳｷｮｳﾄ","ﾆｲｼﾞﾏﾑﾗ"]
[null,null,"東京都","神津島村","ﾄｳｷｮｳﾄ","ｺｳﾂﾞｼﾏﾑﾗ"]
[null,null,"東京都","三宅島三宅村","ﾄｳｷｮｳﾄ","ﾐﾔｹｼﾞﾏﾐﾔｹﾑﾗ"]
[null,null,"東京都","御蔵島村","ﾄｳｷｮｳﾄ","ﾐｸﾗｼﾞﾏﾑﾗ"]
[null,null,"東京都","八丈島八丈町","ﾄｳｷｮｳﾄ","ﾊﾁｼﾞｮｳｼﾞﾏﾊﾁｼﾞｮｳﾏﾁ"]
[null,null,"東京都","青ヶ島村","ﾄｳｷｮｳﾄ","ｱｵｶﾞｼﾏﾑﾗ"]
[null,null,"東京都","小笠原村","ﾄｳｷｮｳﾄ","ｵｶﾞｻﾜﾗﾑﾗ"]
[null,null,"神奈川県","横浜市鶴見区","ｶﾅｶﾞﾜｹﾝ","ﾖｺﾊﾏｼﾂﾙﾐｸ"]
[null,null,"神奈川県","横浜市神奈川区","ｶﾅｶﾞﾜｹﾝ","ﾖｺﾊﾏｼｶﾅｶﾞﾜｸ"]
[null,null,"神奈川県","横浜市西区","ｶﾅｶﾞﾜｹﾝ","ﾖｺﾊﾏｼﾆｼｸ"]
[null,null,"神奈川県","横浜市中区","ｶﾅｶﾞﾜｹﾝ","ﾖｺﾊﾏｼﾅｶｸ"]
[null,null,"神奈川県","横浜市南区","ｶﾅｶﾞﾜｹﾝ","ﾖｺﾊﾏｼﾐﾅﾐｸ"]
[null,null,"神奈川県","横浜市保土ケ谷区","ｶﾅｶﾞﾜｹﾝ","ﾖｺﾊﾏｼﾎﾄﾞｶﾞﾔｸ"]
[null,null,"神奈川県","横浜市磯子区","ｶﾅｶﾞﾜｹﾝ","ﾖｺﾊﾏｼｲｿｺﾞｸ"]
[null,null,"神奈川県","横浜市金沢区","ｶﾅｶﾞﾜｹﾝ","ﾖｺﾊﾏｼｶﾅｻﾞﾜｸ"]
[null,null,"神奈川県","横浜市港北区","ｶﾅｶﾞﾜｹﾝ","ﾖｺﾊﾏｼｺｳﾎｸｸ"]
[null,null,"神奈川県","横浜市戸塚区","ｶﾅｶﾞﾜｹﾝ","ﾖｺﾊﾏｼﾄﾂｶｸ"]
[null,null,"神奈川県","横浜市港南区","ｶﾅｶﾞﾜｹﾝ","ﾖｺﾊﾏｼｺｳﾅﾝｸ"]
[null,null,"神奈川県","横浜市旭区","ｶﾅｶﾞﾜｹﾝ","ﾖｺﾊﾏｼｱｻﾋｸ"]
[null,null,"神奈川県","横浜市緑区","ｶﾅｶﾞﾜｹﾝ","ﾖｺﾊﾏｼﾐﾄﾞﾘｸ"]
[null,null,"神奈川県","横浜市瀬谷区","ｶﾅｶﾞﾜｹﾝ","ﾖｺﾊﾏｼｾﾔｸ"]
[null,null,"神奈川県","横浜市栄区","ｶﾅｶﾞﾜｹﾝ","ﾖｺﾊﾏｼｻｶｴｸ"]
[null,null,"神奈川県","横浜市泉区","ｶﾅｶﾞﾜｹﾝ","ﾖｺﾊﾏｼｲｽﾞﾐｸ"]
[null,null,"神奈川県","横浜市青葉区","ｶﾅｶﾞﾜｹﾝ","ﾖｺﾊﾏｼｱｵﾊﾞｸ"]
[null,null,"神奈川県","横浜市都筑区","ｶﾅｶﾞﾜｹﾝ","ﾖｺﾊﾏｼﾂﾂﾞｷｸ"]
[null,null,"神奈川県","川崎市川崎区","ｶﾅｶﾞﾜｹﾝ","ｶﾜｻｷｼｶﾜｻｷｸ"]
[null,null,"神奈川県","川崎市幸区","ｶﾅｶﾞﾜｹﾝ","ｶﾜｻｷｼｻｲﾜｲｸ"]
[null,null,"神奈川県","川崎市中原区","ｶﾅｶﾞﾜｹﾝ","ｶﾜｻｷｼﾅｶﾊﾗｸ"]
[null,null,"神奈川県","川崎市高津区","ｶﾅｶﾞﾜｹﾝ","ｶﾜｻｷｼﾀｶﾂｸ"]
[null,null,"神奈川県","川崎市多摩区","ｶﾅｶﾞﾜｹﾝ","ｶﾜｻｷｼﾀﾏｸ"]
[null,null,"神奈川県","川崎市宮前区","ｶﾅｶﾞﾜｹﾝ","ｶﾜｻｷｼﾐﾔﾏｴｸ"]
[null,null,"神奈川県","川崎市麻生区","ｶﾅｶﾞﾜｹﾝ","ｶﾜｻｷｼｱｻｵｸ"]
[null,null,"神奈川県","相模原市緑区","ｶﾅｶﾞﾜｹﾝ","ｻｶﾞﾐﾊﾗｼﾐﾄﾞﾘｸ"]
[null,null,"神奈川県","相模原市中央区","ｶﾅｶﾞﾜｹﾝ","ｻｶﾞﾐﾊﾗｼﾁｭｳｵｳｸ"]
[null,null,"神奈川県","相模原市南区","ｶﾅｶﾞﾜｹﾝ","ｻｶﾞﾐﾊﾗｼﾐﾅﾐｸ"]
[null,null,"神奈川県","横須賀市","ｶﾅｶﾞﾜｹﾝ","ﾖｺｽｶｼ"]
[null,null,"神奈川県","平塚市","ｶﾅｶﾞﾜｹﾝ","ﾋﾗﾂｶｼ"]
[null,null,"神奈川県","鎌倉市","ｶﾅｶﾞﾜｹﾝ","ｶﾏｸﾗｼ"]
[null,null,"神奈川県","藤沢市","ｶﾅｶﾞﾜｹﾝ","ﾌｼﾞｻﾜｼ"]
[null,null,"神奈川県","小田原市","ｶﾅｶﾞﾜｹﾝ","ｵﾀﾞﾜﾗｼ"]
[null,null,"神奈川県","茅ヶ崎市","ｶﾅｶﾞﾜｹﾝ","ﾁｶﾞｻｷｼ"]
[null,null,"神奈川県","逗子市","ｶﾅｶﾞﾜｹﾝ","ｽﾞｼｼ"]
[null,null,"神奈川県","三浦市","ｶﾅｶﾞﾜｹﾝ","ﾐｳﾗｼ"]
[null,null,"神奈川県","秦野市","ｶﾅｶﾞﾜｹﾝ","ﾊﾀﾞﾉｼ"]
[null,null,"神奈川県","厚木市","ｶﾅｶﾞﾜｹﾝ","ｱﾂｷﾞｼ"]
[null,null,"神奈川県","大和市","ｶﾅｶﾞﾜｹﾝ","ﾔﾏﾄｼ"]
[null,null,"神奈川県","伊勢原市","ｶﾅｶﾞﾜｹﾝ","ｲｾﾊﾗｼ"]
[null,null,"神奈川県","海老名市","ｶﾅｶﾞﾜｹﾝ","ｴﾋﾞﾅｼ"]
[null,null,"神奈川県","座間市","ｶﾅｶﾞﾜｹﾝ","ｻﾞﾏｼ"]
[null,null,"神奈川県","南足柄市","ｶﾅｶﾞﾜｹﾝ","ﾐﾅﾐｱｼｶﾞﾗｼ"]
[null,null,"神奈川県","綾瀬市","ｶﾅｶﾞﾜｹﾝ","ｱﾔｾｼ"]
[null,null,"神奈川県","三浦郡葉山町","ｶﾅｶﾞﾜｹﾝ","ﾐｳﾗｸﾞﾝﾊﾔﾏﾏﾁ"]
[null,null,"神奈川県","高座郡寒川町","ｶﾅｶﾞﾜｹﾝ","ｺｳｻﾞｸﾞﾝｻﾑｶﾜﾏﾁ"]
[null,null,"神奈川県","中郡大磯町","ｶﾅｶﾞﾜｹﾝ","ﾅｶｸﾞﾝｵｵｲｿﾏﾁ"]
[null,null,"神奈川県","中郡二宮町","ｶﾅｶﾞﾜｹﾝ","ﾅｶｸﾞﾝﾆﾉﾐﾔﾏﾁ"]
[null,null,"神奈川県","足柄上郡中井町","ｶﾅｶﾞﾜｹﾝ","ｱｼｶﾞﾗｶﾐｸﾞﾝﾅｶｲﾏﾁ"]
[null,null,"神奈川県","足柄上郡大井町","ｶﾅｶﾞﾜｹﾝ","ｱｼｶﾞﾗｶﾐｸﾞﾝｵｵｲﾏﾁ"]
[null,null,"神奈川県","足柄上郡松田町","ｶﾅｶﾞﾜｹﾝ","ｱｼｶﾞﾗｶﾐｸﾞﾝﾏﾂﾀﾞﾏﾁ"]
[null,null,"神奈川県","足柄上郡山北町","ｶﾅｶﾞﾜｹﾝ","ｱｼｶﾞﾗｶﾐｸﾞﾝﾔﾏｷﾀﾏﾁ"]
[null,null,"神奈川県","足柄上郡開成町","ｶﾅｶﾞﾜｹﾝ","ｱｼｶﾞﾗｶﾐｸﾞﾝｶｲｾｲﾏﾁ"]
[null,null,"神奈川県","足柄下郡箱根町","ｶﾅｶﾞﾜｹﾝ","ｱｼｶﾞﾗｼﾓｸﾞﾝﾊｺﾈﾏﾁ"]
[null,null,"神奈川県","足柄下郡真鶴町","ｶﾅｶﾞﾜｹﾝ","ｱｼｶﾞﾗｼﾓｸﾞﾝﾏﾅﾂﾞﾙﾏﾁ"]
[null,null,"神奈川県","足柄下郡湯河原町","ｶﾅｶﾞﾜｹﾝ","ｱｼｶﾞﾗｼﾓｸﾞﾝﾕｶﾞﾜﾗﾏﾁ"]
[null,null,"神奈川県","愛甲郡愛川町","ｶﾅｶﾞﾜｹﾝ","ｱｲｺｳｸﾞﾝｱｲｶﾜﾏﾁ"]
[null,null,"神奈川県","愛甲郡清川村","ｶﾅｶﾞﾜｹﾝ","ｱｲｺｳｸﾞﾝｷﾖｶﾜﾑﾗ"]
[null,null,"新潟県","新潟市北区","ﾆｲｶﾞﾀｹﾝ","ﾆｲｶﾞﾀｼｷﾀｸ"]
[null,null,"新潟県","新潟市東区","ﾆｲｶﾞﾀｹﾝ","ﾆｲｶﾞﾀｼﾋｶﾞｼｸ"]
[null,null,"新潟県","新潟市中央区","ﾆｲｶﾞﾀｹﾝ","ﾆｲｶﾞﾀｼﾁｭｳｵｳｸ"]
[null,null,"新潟県","新潟市江南区","ﾆｲｶﾞﾀｹﾝ","ﾆｲｶﾞﾀｼｺｳﾅﾝｸ"]
[null,null,"新潟県","新潟市秋葉区","ﾆｲｶﾞﾀｹﾝ","ﾆｲｶﾞﾀｼｱｷﾊｸ"]
[null,null,"新潟県","新潟市南区","ﾆｲｶﾞﾀｹﾝ","ﾆｲｶﾞﾀｼﾐﾅﾐｸ"]
[null,null,"新潟県","新潟市西区","ﾆｲｶﾞﾀｹﾝ","ﾆｲｶﾞﾀｼﾆｼｸ"]
[null,null,"新潟県","新潟市西蒲区","ﾆｲｶﾞﾀｹﾝ","ﾆｲｶﾞﾀｼﾆｼｶﾝｸ"]
[null,null,"新潟県","長岡市","ﾆｲｶﾞﾀｹﾝ","ﾅｶﾞｵｶｼ"]
[null,null,"新潟県","三条市","ﾆｲｶﾞﾀｹﾝ","ｻﾝｼﾞｮｳｼ"]
[null,null,"新潟県","柏崎市","ﾆｲｶﾞﾀｹﾝ","ｶｼﾜｻﾞｷｼ"]
[null,null,"新潟県","新発田市","ﾆｲｶﾞﾀｹﾝ","ｼﾊﾞﾀｼ"]
[null,null,"新潟県","小千谷市","ﾆｲｶﾞﾀｹﾝ","ｵﾁﾞﾔｼ"]
[null,null,"新潟県","加茂市","ﾆｲｶﾞﾀｹﾝ","ｶﾓｼ"]
[null,null,"新潟県","十日町市","ﾆｲｶﾞﾀｹﾝ","ﾄｵｶﾏﾁｼ"]
[null,null,"新潟県","見附市","ﾆｲｶﾞﾀｹﾝ","ﾐﾂｹｼ"]
[null,null,"新潟県","村上市","ﾆｲｶﾞﾀｹﾝ","ﾑﾗｶﾐｼ"]
[null,null,"新潟県","燕市","ﾆｲｶﾞﾀｹﾝ","ﾂﾊﾞﾒｼ"]
[null,null,"新潟県","糸魚川市","ﾆｲｶﾞﾀｹﾝ","ｲﾄｲｶﾞﾜｼ"]
[null,null,"新潟県","妙高市","ﾆｲｶﾞﾀｹﾝ","ﾐｮｳｺｳｼ"]
[null,null,"新潟県","五泉市","ﾆｲｶﾞﾀｹﾝ","ｺﾞｾﾝｼ"]
[null,null,"新潟県","上越市","ﾆｲｶﾞﾀｹﾝ","ｼﾞｮｳｴﾂｼ"]
[null,null,"新潟県","阿賀野市","ﾆｲｶﾞﾀｹﾝ","ｱｶﾞﾉｼ"]
[null,null,"新潟県","佐渡市","ﾆｲｶﾞﾀｹﾝ","ｻﾄﾞｼ"]
[null,null,"新潟県","魚沼市","ﾆｲｶﾞﾀｹﾝ","ｳｵﾇﾏｼ"]
[null,null,"新潟県","南魚沼市","ﾆｲｶﾞﾀｹﾝ","ﾐﾅﾐｳｵﾇﾏｼ"]
[null,null,"新潟県","胎内市","ﾆｲｶﾞﾀｹﾝ","ﾀｲﾅｲｼ"]
[null,null,"新潟県","北蒲原郡聖籠町","ﾆｲｶﾞﾀｹﾝ","ｷﾀｶﾝﾊﾞﾗｸﾞﾝｾｲﾛｳﾏﾁ"]
[null,null,"新潟県","西蒲原郡弥彦村","ﾆｲｶﾞﾀｹﾝ","ﾆｼｶﾝﾊﾞﾗｸﾞﾝﾔﾋｺﾑﾗ"]
[null,null,"新潟県","南蒲原郡田上町","ﾆｲｶﾞﾀｹﾝ","ﾐﾅﾐｶﾝﾊﾞﾗｸﾞﾝﾀｶﾞﾐﾏﾁ"]
[null,null,"新潟県","東蒲原郡阿賀町","ﾆｲｶﾞﾀｹﾝ","ﾋｶﾞｼｶﾝﾊﾞﾗｸﾞﾝｱｶﾞﾏﾁ"]
[null,null,"新潟県","三島郡出雲崎町","ﾆｲｶﾞﾀｹﾝ","ｻﾝﾄｳｸﾞﾝｲｽﾞﾓｻﾞｷﾏﾁ"]
[null,null,"新潟県","南魚沼郡湯沢町","ﾆｲｶﾞﾀｹﾝ","ﾐﾅﾐｳｵﾇﾏｸﾞﾝﾕｻﾞﾜﾏﾁ"]
[null,null,"新潟県","中魚沼郡津南町","ﾆｲｶﾞﾀｹﾝ","ﾅｶｳｵﾇﾏｸﾞﾝﾂﾅﾝﾏﾁ"]
[null,null,"新潟県","刈羽郡刈羽村","ﾆｲｶﾞﾀｹﾝ","ｶﾘﾜｸﾞﾝｶﾘﾜﾑﾗ"]
[null,null,"新潟県","岩船郡関川村","ﾆｲｶﾞﾀｹﾝ","ｲﾜﾌﾈｸﾞﾝｾｷｶﾜﾑﾗ"]
[null,null,"新潟県","岩船郡粟島浦村","ﾆｲｶﾞﾀｹﾝ","ｲﾜﾌﾈｸﾞﾝｱﾜｼﾏｳﾗﾑﾗ"]
[null,null,"富山県","富山市","ﾄﾔﾏｹﾝ","ﾄﾔﾏｼ"]
[null,null,"富山県","高岡市","ﾄﾔﾏｹﾝ","ﾀｶｵｶｼ"]
[null,null,"富山県","魚津市","ﾄﾔﾏｹﾝ","ｳｵﾂﾞｼ"]
[null,null,"富山県","氷見市","ﾄﾔﾏｹﾝ","ﾋﾐｼ"]
[null,null,"富山県","滑川市","ﾄﾔﾏｹﾝ","ﾅﾒﾘｶﾜｼ"]
[null,null,"富山県","黒部市","ﾄﾔﾏｹﾝ","ｸﾛﾍﾞｼ"]
[null,null,"富山県","砺波市","ﾄﾔﾏｹﾝ","ﾄﾅﾐｼ"]
[null,null,"富山県","小矢部市","ﾄﾔﾏｹﾝ","ｵﾔﾍﾞｼ"]
[null,null,"富山県","南砺市","ﾄﾔﾏｹﾝ","ﾅﾝﾄｼ"]
[null,null,"富山県","射水市","ﾄﾔﾏｹﾝ","ｲﾐｽﾞｼ"]
[null,null,"富山県","中新川郡舟橋村","ﾄﾔﾏｹﾝ","ﾅｶﾆｲｶﾜｸﾞﾝﾌﾅﾊｼﾑﾗ"]
[null,null,"富山県","中新川郡上市町","ﾄﾔﾏｹﾝ","ﾅｶﾆｲｶﾜｸﾞﾝｶﾐｲﾁﾏﾁ"]
[null,null,"富山県","中新川郡立山町","ﾄﾔﾏｹﾝ","ﾅｶﾆｲｶﾜｸﾞﾝﾀﾃﾔﾏﾏﾁ"]
[null,null,"富山県","下新川郡入善町","ﾄﾔﾏｹﾝ","ｼﾓﾆｲｶﾜｸﾞﾝﾆｭｳｾﾞﾝﾏﾁ"]
[null,null,"富山県","下新川郡朝日町","ﾄﾔﾏｹﾝ","ｼﾓﾆｲｶﾜｸﾞﾝｱｻﾋﾏﾁ"]
[null,null,"石川県","金沢市","ｲｼｶﾜｹﾝ","ｶﾅｻﾞﾜｼ"]
[null,null,"石川県","七尾市","ｲｼｶﾜｹﾝ","ﾅﾅｵｼ"]
[null,null,"石川県","小松市","ｲｼｶﾜｹﾝ","ｺﾏﾂｼ"]
[null,null,"石川県","輪島市","ｲｼｶﾜｹﾝ","ﾜｼﾞﾏｼ"]
[null,null,"石川県","珠洲市","ｲｼｶﾜｹﾝ","ｽｽﾞｼ"]
[null,null,"石川県","加賀市","ｲｼｶﾜｹﾝ","ｶｶﾞｼ"]
[null,null,"石川県","羽咋市","ｲｼｶﾜｹﾝ","ﾊｸｲｼ"]
[null,null,"石川県","かほく市","ｲｼｶﾜｹﾝ","ｶﾎｸｼ"]
[null,null,"石川県","白山市","ｲｼｶﾜｹﾝ","ﾊｸｻﾝｼ"]
[null,null,"石川県","能美市","ｲｼｶﾜｹﾝ","ﾉﾐｼ"]
[null,null,"石川県","野々市市","ｲｼｶﾜｹﾝ","ﾉﾉｲﾁｼ"]
[null,null,"石川県","能美郡川北町","ｲｼｶﾜｹﾝ","ﾉﾐｸﾞﾝｶﾜｷﾀﾏﾁ"]
[null,null,"石川県","河北郡津幡町","ｲｼｶﾜｹﾝ","ｶﾎｸｸﾞﾝﾂﾊﾞﾀﾏﾁ"]
[null,null,"石川県","河北郡内灘町","ｲｼｶﾜｹﾝ","ｶﾎｸｸﾞﾝｳﾁﾅﾀﾞﾏﾁ"]
[null,null,"石川県","羽咋郡志賀町","ｲｼｶﾜｹﾝ","ﾊｸｲｸﾞﾝｼｶﾏﾁ"]
[null,null,"石川県","羽咋郡宝達志水町","ｲｼｶﾜｹﾝ","ﾊｸｲｸﾞﾝﾎｳﾀﾞﾂｼﾐｽﾞﾁｮｳ"]
[null,null,"石川県","鹿島郡中能登町","ｲｼｶﾜｹﾝ","ｶｼﾏｸﾞﾝﾅｶﾉﾄﾏﾁ"]
[null,null,"石川県","鳳珠郡穴水町","ｲｼｶﾜｹﾝ","ﾎｳｽｸﾞﾝｱﾅﾐｽﾞﾏﾁ"]
[null,null,"石川県","鳳珠郡能登町","ｲｼｶﾜｹﾝ","ﾎｳｽｸﾞﾝﾉﾄﾁｮｳ"]
[null,null,"福井県","福井市","ﾌｸｲｹﾝ","ﾌｸｲｼ"]
[null,null,"福井県","敦賀市","ﾌｸｲｹﾝ","ﾂﾙｶﾞｼ"]
[null,null,"福井県","小浜市","ﾌｸｲｹﾝ","ｵﾊﾞﾏｼ"]
[null,null,"福井県","大野市","ﾌｸｲｹﾝ","ｵｵﾉｼ"]
[null,null,"福井県","勝山市","ﾌｸｲｹﾝ","ｶﾂﾔﾏｼ"]
[null,null,"福井県","鯖江市","ﾌｸｲｹﾝ","ｻﾊﾞｴｼ"]
[null,null,"福井県","あわら市","ﾌｸｲｹﾝ","ｱﾜﾗｼ"]
[null,null,"福井県","越前市","ﾌｸｲｹﾝ","ｴﾁｾﾞﾝｼ"]
[null,null,"福井県","坂井市","ﾌｸｲｹﾝ","ｻｶｲｼ"]
[null,null,"福井県","吉田郡永平寺町","ﾌｸｲｹﾝ","ﾖｼﾀﾞｸﾞﾝｴｲﾍｲｼﾞﾁｮｳ"]
[null,null,"福井県","今立郡池田町","ﾌｸｲｹﾝ","ｲﾏﾀﾞﾃｸﾞﾝｲｹﾀﾞﾁｮｳ"]
[null,null,"福井県","南条郡南越前町","ﾌｸｲｹﾝ","ﾅﾝｼﾞｮｳｸﾞﾝﾐﾅﾐｴﾁｾﾞﾝﾁｮｳ"]
[null,null,"福井県","丹生郡越前町","ﾌｸｲｹﾝ","ﾆｭｳｸﾞﾝｴﾁｾﾞﾝﾁｮｳ"]
[null,null,"福井県","三方郡美浜町","ﾌｸｲｹﾝ","ﾐｶﾀｸﾞﾝﾐﾊﾏﾁｮｳ"]
[null,null,"福井県","大飯郡高浜町","ﾌｸｲｹﾝ","ｵｵｲｸﾞﾝﾀｶﾊﾏﾁｮｳ"]
[null,null,"福井県","大飯郡おおい町","ﾌｸｲｹﾝ","ｵｵｲｸﾞﾝｵｵｲﾁｮｳ"]
[null,null,"福井県","三方上中郡若狭町","ﾌｸｲｹﾝ","ﾐｶﾀｶﾐﾅｶｸﾞﾝﾜｶｻﾁｮｳ"]
[null,null,"山梨県","甲府市","ﾔﾏﾅｼｹﾝ","ｺｳﾌｼ"]
[null,null,"山梨県","富士吉田市","ﾔﾏﾅｼｹﾝ","ﾌｼﾞﾖｼﾀﾞｼ"]
[null,null,"山梨県","都留市","ﾔﾏﾅｼｹﾝ","ﾂﾙｼ"]
[null,null,"山梨県","山梨市","ﾔﾏﾅｼｹﾝ","ﾔﾏﾅｼｼ"]
[null,null,"山梨県","大月市","ﾔﾏﾅｼｹﾝ","ｵｵﾂｷｼ"]
[null,null,"山梨県","韮崎市","ﾔﾏﾅｼｹﾝ","ﾆﾗｻｷｼ"]
[null,null,"山梨県","南アルプス市","ﾔﾏﾅｼｹﾝ","ﾐﾅﾐｱﾙﾌﾟｽｼ"]
[null,null,"山梨県","北杜市","ﾔﾏﾅｼｹﾝ","ﾎｸﾄｼ"]
[null,null,"山梨県","甲斐市","ﾔﾏﾅｼｹﾝ","ｶｲｼ"]
[null,null,"山梨県","笛吹市","ﾔﾏﾅｼｹﾝ","ﾌｴﾌｷｼ"]
[null,null,"山梨県","上野原市","ﾔﾏﾅｼｹﾝ","ｳｴﾉﾊﾗｼ"]
[null,null,"山梨県","甲州市","ﾔﾏﾅｼｹﾝ","ｺｳｼｭｳｼ"]
[null,null,"山梨県","中央市","ﾔﾏﾅｼｹﾝ","ﾁｭｳｵｳｼ"]
[null,null,"山梨県","西八代郡市川三郷町","ﾔﾏﾅｼｹﾝ","ﾆｼﾔﾂｼﾛｸﾞﾝｲﾁｶﾜﾐｻﾄﾁｮｳ"]
[null,null,"山梨県","南巨摩郡早川町","ﾔﾏﾅｼｹﾝ","ﾐﾅﾐｺﾏｸﾞﾝﾊﾔｶﾜﾁｮｳ"]
[null,null,"山梨県","南巨摩郡身延町","ﾔﾏﾅｼｹﾝ","ﾐﾅﾐｺﾏｸﾞﾝﾐﾉﾌﾞﾁｮｳ"]
[null,null,"山梨県","南巨摩郡南部町","ﾔﾏﾅｼｹﾝ","ﾐﾅﾐｺﾏｸﾞﾝﾅﾝﾌﾞﾁｮｳ"]
[null,null,"山梨県","南巨摩郡富士川町","ﾔﾏﾅｼｹﾝ","ﾐﾅﾐｺﾏｸﾞﾝﾌｼﾞｶﾜﾁｮｳ"]
[null,null,"山梨県","中巨摩郡昭和町","ﾔﾏﾅｼｹﾝ","ﾅｶｺﾏｸﾞﾝｼｮｳﾜﾁｮｳ"]
[null,null,"山梨県","南都留郡道志村","ﾔﾏﾅｼｹﾝ","ﾐﾅﾐﾂﾙｸﾞﾝﾄﾞｳｼﾑﾗ"]
[null,null,"山梨県","南都留郡西桂町","ﾔﾏﾅｼｹﾝ","ﾐﾅﾐﾂﾙｸﾞﾝﾆｼｶﾂﾗﾁｮｳ"]
[null,null,"山梨県","南都留郡忍野村","ﾔﾏﾅｼｹﾝ","ﾐﾅﾐﾂﾙｸﾞﾝｵｼﾉﾑﾗ"]
[null,null,"山梨県","南都留郡山中湖村","ﾔﾏﾅｼｹﾝ","ﾐﾅﾐﾂﾙｸﾞﾝﾔﾏﾅｶｺﾑﾗ"]
[null,null,"山梨県","南都留郡鳴沢村","ﾔﾏﾅｼｹﾝ","ﾐﾅﾐﾂﾙｸﾞﾝﾅﾙｻﾜﾑﾗ"]
[null,null,"山梨県","南都留郡富士河口湖町","ﾔﾏﾅｼｹﾝ","ﾐﾅﾐﾂﾙｸﾞﾝﾌｼﾞｶﾜｸﾞﾁｺﾏﾁ"]
[null,null,"山梨県","北都留郡小菅村","ﾔﾏﾅｼｹﾝ","ｷﾀﾂﾙｸﾞﾝｺｽｹﾞﾑﾗ"]
[null,null,"山梨県","北都留郡丹波山村","ﾔﾏﾅｼｹﾝ","ｷﾀﾂﾙｸﾞﾝﾀﾊﾞﾔﾏﾑﾗ"]
[null,null,"長野県","長野市","ﾅｶﾞﾉｹﾝ","ﾅｶﾞﾉｼ"]
[null,null,"長野県","松本市","ﾅｶﾞﾉｹﾝ","ﾏﾂﾓﾄｼ"]
[null,null,"長野県","上田市","ﾅｶﾞﾉｹﾝ","ｳｴﾀﾞｼ"]
[null,null,"長野県","岡谷市","ﾅｶﾞﾉｹﾝ","ｵｶﾔｼ"]
[null,null,"長野県","飯田市","ﾅｶﾞﾉｹﾝ","ｲｲﾀﾞｼ"]
[null,null,"長野県","諏訪市","ﾅｶﾞﾉｹﾝ","ｽﾜｼ"]
[null,null,"長野県","須坂市","ﾅｶﾞﾉｹﾝ","ｽｻﾞｶｼ"]
[null,null,"長野県","小諸市","ﾅｶﾞﾉｹﾝ","ｺﾓﾛｼ"]
[null,null,"長野県","伊那市","ﾅｶﾞﾉｹﾝ","ｲﾅｼ"]
[null,null,"長野県","駒ヶ根市","ﾅｶﾞﾉｹﾝ","ｺﾏｶﾞﾈｼ"]
[null,null,"長野県","中野市","ﾅｶﾞﾉｹﾝ","ﾅｶﾉｼ"]
[null,null,"長野県","大町市","ﾅｶﾞﾉｹﾝ","ｵｵﾏﾁｼ"]
[null,null,"長野県","飯山市","ﾅｶﾞﾉｹﾝ","ｲｲﾔﾏｼ"]
[null,null,"長野県","茅野市","ﾅｶﾞﾉｹﾝ","ﾁﾉｼ"]
[null,null,"長野県","塩尻市","ﾅｶﾞﾉｹﾝ","ｼｵｼﾞﾘｼ"]
[null,null,"長野県","佐久市","ﾅｶﾞﾉｹﾝ","ｻｸｼ"]
[null,null,"長野県","千曲市","ﾅｶﾞﾉｹﾝ","ﾁｸﾏｼ"]
[null,null,"長野県","東御市","ﾅｶﾞﾉｹﾝ","ﾄｳﾐｼ"]
[null,null,"長野県","安曇野市","ﾅｶﾞﾉｹﾝ","ｱﾂﾞﾐﾉｼ"]
[null,null,"長野県","南佐久郡小海町","ﾅｶﾞﾉｹﾝ","ﾐﾅﾐｻｸｸﾞﾝｺｳﾐﾏﾁ"]
[null,null,"長野県","南佐久郡川上村","ﾅｶﾞﾉｹﾝ","ﾐﾅﾐｻｸｸﾞﾝｶﾜｶﾐﾑﾗ"]
[null,null,"長野県","南佐久郡南牧村","ﾅｶﾞﾉｹﾝ","ﾐﾅﾐｻｸｸﾞﾝﾐﾅﾐﾏｷﾑﾗ"]
[null,null,"長野県","南佐久郡南相木村","ﾅｶﾞﾉｹﾝ","ﾐﾅﾐｻｸｸﾞﾝﾐﾅﾐｱｲｷﾑﾗ"]
[null,null,"長野県","南佐久郡北相木村","ﾅｶﾞﾉｹﾝ","ﾐﾅﾐｻｸｸﾞﾝｷﾀｱｲｷﾑﾗ"]
[null,null,"長野県","南佐久郡佐久穂町","ﾅｶﾞﾉｹﾝ","ﾐﾅﾐｻｸｸﾞﾝｻｸﾎﾏﾁ"]
[null,null,"長野県","北佐久郡軽井沢町","ﾅｶﾞﾉｹﾝ","ｷﾀｻｸｸﾞﾝｶﾙｲｻﾞﾜﾏﾁ"]
[null,null,"長野県","北佐久郡御代田町","ﾅｶﾞﾉｹﾝ","ｷﾀｻｸｸﾞﾝﾐﾖﾀﾏﾁ"]
[null,null,"長野県","北佐久郡立科町","ﾅｶﾞﾉｹﾝ","ｷﾀｻｸｸﾞﾝﾀﾃｼﾅﾏﾁ"]
[null,null,"長野県","小県郡青木村","ﾅｶﾞﾉｹﾝ","ﾁｲｻｶﾞﾀｸﾞﾝｱｵｷﾑﾗ"]
[null,null,"長野県","小県郡長和町","ﾅｶﾞﾉｹﾝ","ﾁｲｻｶﾞﾀｸﾞﾝﾅｶﾞﾜﾏﾁ"]
[null,null,"長野県","諏訪郡下諏訪町","ﾅｶﾞﾉｹﾝ","ｽﾜｸﾞﾝｼﾓｽﾜﾏﾁ"]
[null,null,"長野県","諏訪郡富士見町","ﾅｶﾞﾉｹﾝ","ｽﾜｸﾞﾝﾌｼﾞﾐﾏﾁ"]
[null,null,"長野県","諏訪郡原村","ﾅｶﾞﾉｹﾝ","ｽﾜｸﾞﾝﾊﾗﾑﾗ"]
[null,null,"長野県","上伊那郡辰野町","ﾅｶﾞﾉｹﾝ","ｶﾐｲﾅｸﾞﾝﾀﾂﾉﾏﾁ"]
[null,null,"長野県","上伊那郡箕輪町","ﾅｶﾞﾉｹﾝ","ｶﾐｲﾅｸﾞﾝﾐﾉﾜﾏﾁ"]
[null,null,"長野県","上伊那郡飯島町","ﾅｶﾞﾉｹﾝ","ｶﾐｲﾅｸﾞﾝｲｲｼﾞﾏﾏﾁ"]
[null,null,"長野県","上伊那郡南箕輪村","ﾅｶﾞﾉｹﾝ","ｶﾐｲﾅｸﾞﾝﾐﾅﾐﾐﾉﾜﾑﾗ"]
[null,null,"長野県","上伊那郡中川村","ﾅｶﾞﾉｹﾝ","ｶﾐｲﾅｸﾞﾝﾅｶｶﾞﾜﾑﾗ"]
[null,null,"長野県","上伊那郡宮田村","ﾅｶﾞﾉｹﾝ","ｶﾐｲﾅｸﾞﾝﾐﾔﾀﾞﾑﾗ"]
[null,null,"長野県","下伊那郡松川町","ﾅｶﾞﾉｹﾝ","ｼﾓｲﾅｸﾞﾝﾏﾂｶﾜﾏﾁ"]
[null,null,"長野県","下伊那郡高森町","ﾅｶﾞﾉｹﾝ","ｼﾓｲﾅｸﾞﾝﾀｶﾓﾘﾏﾁ"]
[null,null,"長野県","下伊那郡阿南町","ﾅｶﾞﾉｹﾝ","ｼﾓｲﾅｸﾞﾝｱﾅﾝﾁｮｳ"]
[null,null,"長野県","下伊那郡阿智村","ﾅｶﾞﾉｹﾝ","ｼﾓｲﾅｸﾞﾝｱﾁﾑﾗ"]
[null,null,"長野県","下伊那郡平谷村","ﾅｶﾞﾉｹﾝ","ｼﾓｲﾅｸﾞﾝﾋﾗﾔﾑﾗ"]
[null,null,"長野県","下伊那郡根羽村","ﾅｶﾞﾉｹﾝ","ｼﾓｲﾅｸﾞﾝﾈﾊﾞﾑﾗ"]
[null,null,"長野県","下伊那郡下條村","ﾅｶﾞﾉｹﾝ","ｼﾓｲﾅｸﾞﾝｼﾓｼﾞｮｳﾑﾗ"]
[null,null,"長野県","下伊那郡売木村","ﾅｶﾞﾉｹﾝ","ｼﾓｲﾅｸﾞﾝｳﾙｷﾞﾑﾗ"]
[null,null,"長野県","下伊那郡天龍村","ﾅｶﾞﾉｹﾝ","ｼﾓｲﾅｸﾞﾝﾃﾝﾘｭｳﾑﾗ"]
[null,null,"長野県","下伊那郡泰阜村","ﾅｶﾞﾉｹﾝ","ｼﾓｲﾅｸﾞﾝﾔｽｵｶﾑﾗ"]
[null,null,"長野県","下伊那郡喬木村","ﾅｶﾞﾉｹﾝ","ｼﾓｲﾅｸﾞﾝﾀｶｷﾞﾑﾗ"]
[null,null,"長野県","下伊那郡豊丘村","ﾅｶﾞﾉｹﾝ","ｼﾓｲﾅｸﾞﾝﾄﾖｵｶﾑﾗ"]
[null,null,"長野県","下伊那郡大鹿村","ﾅｶﾞﾉｹﾝ","ｼﾓｲﾅｸﾞﾝｵｵｼｶﾑﾗ"]
[null,null,"長野県","木曽郡上松町","ﾅｶﾞﾉｹﾝ","ｷｿｸﾞﾝｱｹﾞﾏﾂﾏﾁ"]
[null,null,"長野県","木曽郡南木曽町","ﾅｶﾞﾉｹﾝ","ｷｿｸﾞﾝﾅｷﾞｿﾏﾁ"]
[null,null,"長野県","木曽郡木祖村","ﾅｶﾞﾉｹﾝ","ｷｿｸﾞﾝｷｿﾑﾗ"]
[null,null,"長野県","木曽郡王滝村","ﾅｶﾞﾉｹﾝ","ｷｿｸﾞﾝｵｳﾀｷﾑﾗ"]
[null,null,"長野県","木曽郡大桑村","ﾅｶﾞﾉｹﾝ","ｷｿｸﾞﾝｵｵｸﾜﾑﾗ"]
[null,null,"長野県","木曽郡木曽町","ﾅｶﾞﾉｹﾝ","ｷｿｸﾞﾝｷｿﾏﾁ"]
[null,null,"長野県","東筑摩郡麻績村","ﾅｶﾞﾉｹﾝ","ﾋｶﾞｼﾁｸﾏｸﾞﾝｵﾐﾑﾗ"]
[null,null,"長野県","東筑摩郡生坂村","ﾅｶﾞﾉｹﾝ","ﾋｶﾞｼﾁｸﾏｸﾞﾝｲｸｻｶﾑﾗ"]
[null,null,"長野県","東筑摩郡山形村","ﾅｶﾞﾉｹﾝ","ﾋｶﾞｼﾁｸﾏｸﾞﾝﾔﾏｶﾞﾀﾑﾗ"]
[null,null,"長野県","東筑摩郡朝日村","ﾅｶﾞﾉｹﾝ","ﾋｶﾞｼﾁｸﾏｸﾞﾝｱｻﾋﾑﾗ"]
[null,null,"長野県","東筑摩郡筑北村","ﾅｶﾞﾉｹﾝ","ﾋｶﾞｼﾁｸﾏｸﾞﾝﾁｸﾎｸﾑﾗ"]
[null,null,"長野県","北安曇郡池田町","ﾅｶﾞﾉｹﾝ","ｷﾀｱﾂﾞﾐｸﾞﾝｲｹﾀﾞﾏﾁ"]
[null,null,"長野県","北安曇郡松川村","ﾅｶﾞﾉｹﾝ","ｷﾀｱﾂﾞﾐｸﾞﾝﾏﾂｶﾜﾑﾗ"]
[null,null,"長野県","北安曇郡白馬村","ﾅｶﾞﾉｹﾝ","ｷﾀｱﾂﾞﾐｸﾞﾝﾊｸﾊﾞﾑﾗ"]
[null,null,"長野県","北安曇郡小谷村","ﾅｶﾞﾉｹﾝ","ｷﾀｱﾂﾞﾐｸﾞﾝｵﾀﾘﾑﾗ"]
[null,null,"長野県","埴科郡坂城町","ﾅｶﾞﾉｹﾝ","ﾊﾆｼﾅｸﾞﾝｻｶｷﾏﾁ"]
[null,null,"長野県","上高井郡小布施町","ﾅｶﾞﾉｹﾝ","ｶﾐﾀｶｲｸﾞﾝｵﾌﾞｾﾏﾁ"]
[null,null,"長野県","上高井郡高山村","ﾅｶﾞﾉｹﾝ","ｶﾐﾀｶｲｸﾞﾝﾀｶﾔﾏﾑﾗ"]
[null,null,"長野県","下高井郡山ノ内町","ﾅｶﾞﾉｹﾝ","ｼﾓﾀｶｲｸﾞﾝﾔﾏﾉｳﾁﾏﾁ"]
[null,null,"長野県","下高井郡木島平村","ﾅｶﾞﾉｹﾝ","ｼﾓﾀｶｲｸﾞﾝｷｼﾞﾏﾀﾞｲﾗﾑﾗ"]
[null,null,"長野県","下高井郡野沢温泉村","ﾅｶﾞﾉｹﾝ","ｼﾓﾀｶｲｸﾞﾝﾉｻﾞﾜｵﾝｾﾝﾑﾗ"]
[null,null,"長野県","上水内郡信濃町","ﾅｶﾞﾉｹﾝ","ｶﾐﾐﾉﾁｸﾞﾝｼﾅﾉﾏﾁ"]
[null,null,"長野県","上水内郡小川村","ﾅｶﾞﾉｹﾝ","ｶﾐﾐﾉﾁｸﾞﾝｵｶﾞﾜﾑﾗ"]
[null,null,"長野県","上水内郡飯綱町","ﾅｶﾞﾉｹﾝ","ｶﾐﾐﾉﾁｸﾞﾝｲｲﾂﾞﾅﾏﾁ"]
[null,null,"長野県","下水内郡栄村","ﾅｶﾞﾉｹﾝ","ｼﾓﾐﾉﾁｸﾞﾝｻｶｴﾑﾗ"]
[null,null,"岐阜県","岐阜市","ｷﾞﾌｹﾝ","ｷﾞﾌｼ"]
[null,null,"岐阜県","大垣市","ｷﾞﾌｹﾝ","ｵｵｶﾞｷｼ"]
[null,null,"岐阜県","高山市","ｷﾞﾌｹﾝ","ﾀｶﾔﾏｼ"]
[null,null,"岐阜県","多治見市","ｷﾞﾌｹﾝ","ﾀｼﾞﾐｼ"]
[null,null,"岐阜県","関市","ｷﾞﾌｹﾝ","ｾｷｼ"]
[null,null,"岐阜県","中津川市","ｷﾞﾌｹﾝ","ﾅｶﾂｶﾞﾜｼ"]
[null,null,"岐阜県","美濃市","ｷﾞﾌｹﾝ","ﾐﾉｼ"]
[null,null,"岐阜県","瑞浪市","ｷﾞﾌｹﾝ","ﾐｽﾞﾅﾐｼ"]
[null,null,"岐阜県","羽島市","ｷﾞﾌｹﾝ","ﾊｼﾏｼ"]
[null,null,"岐阜県","恵那市","ｷﾞﾌｹﾝ","ｴﾅｼ"]
[null,null,"岐阜県","美濃加茂市","ｷﾞﾌｹﾝ","ﾐﾉｶﾓｼ"]
[null,null,"岐阜県","土岐市","ｷﾞﾌｹﾝ","ﾄｷｼ"]
[null,null,"岐阜県","各務原市","ｷﾞﾌｹﾝ","ｶｶﾐｶﾞﾊﾗｼ"]
[null,null,"岐阜県","可児市","ｷﾞﾌｹﾝ","ｶﾆｼ"]
[null,null,"岐阜県","山県市","ｷﾞﾌｹﾝ","ﾔﾏｶﾞﾀｼ"]
[null,null,"岐阜県","瑞穂市","ｷﾞﾌｹﾝ","ﾐｽﾞﾎｼ"]
[null,null,"岐阜県","飛騨市","ｷﾞﾌｹﾝ","ﾋﾀﾞｼ"]
[null,null,"岐阜県","本巣市","ｷﾞﾌｹﾝ","ﾓﾄｽｼ"]
[null,null,"岐阜県","郡上市","ｷﾞﾌｹﾝ","ｸﾞｼﾞｮｳｼ"]
[null,null,"岐阜県","下呂市","ｷﾞﾌｹﾝ","ｹﾞﾛｼ"]
[null,null,"岐阜県","海津市","ｷﾞﾌｹﾝ","ｶｲﾂﾞｼ"]
[null,null,"岐阜県","羽島郡岐南町","ｷﾞﾌｹﾝ","ﾊｼﾏｸﾞﾝｷﾞﾅﾝﾁｮｳ"]
[null,null,"岐阜県","羽島郡笠松町","ｷﾞﾌｹﾝ","ﾊｼﾏｸﾞﾝｶｻﾏﾂﾁｮｳ"]
[null,null,"岐阜県","養老郡養老町","ｷﾞﾌｹﾝ","ﾖｳﾛｳｸﾞﾝﾖｳﾛｳﾁｮｳ"]
[null,null,"岐阜県","不破郡垂井町","ｷﾞﾌｹﾝ","ﾌﾜｸﾞﾝﾀﾙｲﾁｮｳ"]
[null,null,"岐阜県","不破郡関ケ原町","ｷﾞﾌｹﾝ","ﾌﾜｸﾞﾝｾｷｶﾞﾊﾗﾁｮｳ"]
[null,null,"岐阜県","安八郡神戸町","ｷﾞﾌｹﾝ","ｱﾝﾊﾟﾁｸﾞﾝｺﾞｳﾄﾞﾁｮｳ"]
[null,null,"岐阜県","安八郡輪之内町","ｷﾞﾌｹﾝ","ｱﾝﾊﾟﾁｸﾞﾝﾜﾉｳﾁﾁｮｳ"]
[null,null,"岐阜県","安八郡安八町","ｷﾞﾌｹﾝ","ｱﾝﾊﾟﾁｸﾞﾝｱﾝﾊﾟﾁﾁｮｳ"]
[null,null,"岐阜県","揖斐郡揖斐川町","ｷﾞﾌｹﾝ","ｲﾋﾞｸﾞﾝｲﾋﾞｶﾞﾜﾁｮｳ"]
[null,null,"岐阜県","揖斐郡大野町","ｷﾞﾌｹﾝ","ｲﾋﾞｸﾞﾝｵｵﾉﾁｮｳ"]
[null,null,"岐阜県","揖斐郡池田町","ｷﾞﾌｹﾝ","ｲﾋﾞｸﾞﾝｲｹﾀﾞﾁｮｳ"]
[null,null,"岐阜県","本巣郡北方町","ｷﾞﾌｹﾝ","ﾓﾄｽｸﾞﾝｷﾀｶﾞﾀﾁｮｳ"]
[null,null,"岐阜県","加茂郡坂祝町","ｷﾞﾌｹﾝ","ｶﾓｸﾞﾝｻｶﾎｷﾞﾁｮｳ"]
[null,null,"岐阜県","加茂郡富加町","ｷﾞﾌｹﾝ","ｶﾓｸﾞﾝﾄﾐｶﾁｮｳ"]
[null,null,"岐阜県","加茂郡川辺町","ｷﾞﾌｹﾝ","ｶﾓｸﾞﾝｶﾜﾍﾞﾁｮｳ"]
[null,null,"岐阜県","加茂郡七宗町","ｷﾞﾌｹﾝ","ｶﾓｸﾞﾝﾋﾁｿｳﾁｮｳ"]
[null,null,"岐阜県","加茂郡八百津町","ｷﾞﾌｹﾝ","ｶﾓｸﾞﾝﾔｵﾂﾁｮｳ"]
[null,null,"岐阜県","加茂郡白川町","ｷﾞﾌｹﾝ","ｶﾓｸﾞﾝｼﾗｶﾜﾁｮｳ"]
[null,null,"岐阜県","加茂郡東白川村","ｷﾞﾌｹﾝ","ｶﾓｸﾞﾝﾋｶﾞｼｼﾗｶﾜﾑﾗ"]
[null,null,"岐阜県","可児郡御嵩町","ｷﾞﾌｹﾝ","ｶﾆｸﾞﾝﾐﾀｹﾁｮｳ"]
[null,null,"岐阜県","大野郡白川村","ｷﾞﾌｹﾝ","ｵｵﾉｸﾞﾝｼﾗｶﾜﾑﾗ"]
[null,null,"静岡県","静岡市葵区","ｼｽﾞｵｶｹﾝ","ｼｽﾞｵｶｼｱｵｲｸ"]
[null,null,"静岡県","静岡市駿河区","ｼｽﾞｵｶｹﾝ","ｼｽﾞｵｶｼｽﾙｶﾞｸ"]
[null,null,"静岡県","静岡市清水区","ｼｽﾞｵｶｹﾝ","ｼｽﾞｵｶｼｼﾐｽﾞｸ"]
[null,null,"静岡県","浜松市中央区","ｼｽﾞｵｶｹﾝ","ﾊﾏﾏﾂｼﾁｭｳｵｳｸ"]
[null,null,"静岡県","浜松市浜名区","ｼｽﾞｵｶｹﾝ","ﾊﾏﾏﾂｼﾊﾏﾅｸ"]
[null,null,"静岡県","浜松市天竜区","ｼｽﾞｵｶｹﾝ","ﾊﾏﾏﾂｼﾃﾝﾘｭｳｸ"]
[null,null,"静岡県","沼津市","ｼｽﾞｵｶｹﾝ","ﾇﾏﾂﾞｼ"]
[null,null,"静岡県","熱海市","ｼｽﾞｵｶｹﾝ","ｱﾀﾐｼ"]
[null,null,"静岡県","三島市","ｼｽﾞｵｶｹﾝ","ﾐｼﾏｼ"]
[null,null,"静岡県","富士宮市","ｼｽﾞｵｶｹﾝ","ﾌｼﾞﾉﾐﾔｼ"]
[null,null,"静岡県","伊東市","ｼｽﾞｵｶｹﾝ","ｲﾄｳｼ"]
[null,null,"静岡県","島田市","ｼｽﾞｵｶｹﾝ","ｼﾏﾀﾞｼ"]
[null,null,"静岡県","富士市","ｼｽﾞｵｶｹﾝ","ﾌｼﾞｼ"]
[null,null,"静岡県","磐田市","ｼｽﾞｵｶｹﾝ","ｲﾜﾀｼ"]
[null,null,"静岡県","焼津市","ｼｽﾞｵｶｹﾝ","ﾔｲﾂﾞｼ"]
[null,null,"静岡県","掛川市","ｼｽﾞｵｶｹﾝ","ｶｹｶﾞﾜｼ"]
[null,null,"静岡県","藤枝市","ｼｽﾞｵｶｹﾝ","ﾌｼﾞｴﾀﾞｼ"]
[null,null,"静岡県","御殿場市","ｼｽﾞｵｶｹﾝ","ｺﾞﾃﾝﾊﾞｼ"]
[null,null,"静岡県","袋井市","ｼｽﾞｵｶｹﾝ","ﾌｸﾛｲｼ"]
[null,null,"静岡県","下田市","ｼｽﾞｵｶｹﾝ","ｼﾓﾀﾞｼ"]
[null,null,"静岡県","裾野市","ｼｽﾞｵｶｹﾝ","ｽｿﾉｼ"]
[null,null,"静岡県","湖西市","ｼｽﾞｵｶｹﾝ","ｺｻｲｼ"]
[null,null,"静岡県","伊豆市","ｼｽﾞｵｶｹﾝ","ｲｽﾞｼ"]
[null,null,"静岡県","御前崎市","ｼｽﾞｵｶｹﾝ","ｵﾏｴｻﾞｷｼ"]
[null,null,"静岡県","菊川市","ｼｽﾞｵｶｹﾝ","ｷｸｶﾞﾜｼ"]
[null,null,"静岡県","伊豆の国市","ｼｽﾞｵｶｹﾝ","ｲｽﾞﾉｸﾆｼ"]
[null,null,"静岡県","牧之原市","ｼｽﾞｵｶｹﾝ","ﾏｷﾉﾊﾗｼ"]
[null,null,"静岡県","賀茂郡東伊豆町","ｼｽﾞｵｶｹﾝ","ｶﾓｸﾞﾝﾋｶﾞｼｲｽﾞﾁｮｳ"]
[null,null,"静岡県","賀茂郡河津町","ｼｽﾞｵｶｹﾝ","ｶﾓｸﾞﾝｶﾜﾂﾞﾁｮｳ"]
[null,null,"静岡県","賀茂郡南伊豆町","ｼｽﾞｵｶｹﾝ","ｶﾓｸﾞﾝﾐﾅﾐｲｽﾞﾁｮｳ"]
[null,null,"静岡県","賀茂郡松崎町","ｼｽﾞｵｶｹﾝ","ｶﾓｸﾞﾝﾏﾂｻﾞｷﾁｮｳ"]
[null,null,"静岡県","賀茂郡西伊豆町","ｼｽﾞｵｶｹﾝ","ｶﾓｸﾞﾝﾆｼｲｽﾞﾁｮｳ"]
[null,null,"静岡県","田方郡函南町","ｼｽﾞｵｶｹﾝ","ﾀｶﾞﾀｸﾞﾝｶﾝﾅﾐﾁｮｳ"]
[null,null,"静岡県","駿東郡清水町","ｼｽﾞｵｶｹﾝ","ｽﾝﾄｳｸﾞﾝｼﾐｽﾞﾁｮｳ"]
[null,null,"静岡県","駿東郡長泉町","ｼｽﾞｵｶｹﾝ","ｽﾝﾄｳｸﾞﾝﾅｶﾞｲｽﾞﾐﾁｮｳ"]
[null,null,"静岡県","駿東郡小山町","ｼｽﾞｵｶｹﾝ","ｽﾝﾄｳｸﾞﾝｵﾔﾏﾁｮｳ"]
[null,null,"静岡県","榛原郡吉田町","ｼｽﾞｵｶｹﾝ","ﾊｲﾊﾞﾗｸﾞﾝﾖｼﾀﾞﾁｮｳ"]
[null,null,"静岡県","榛原郡川根本町","ｼｽﾞｵｶｹﾝ","ﾊｲﾊﾞﾗｸﾞﾝｶﾜﾈﾎﾝﾁｮｳ"]
[null,null,"静岡県","周智郡森町","ｼｽﾞｵｶｹﾝ","ｼｭｳﾁｸﾞﾝﾓﾘﾏﾁ"]
[null,null,"愛知県","名古屋市千種区","ｱｲﾁｹﾝ","ﾅｺﾞﾔｼﾁｸｻｸ"]
[null,null,"愛知県","名古屋市東区","ｱｲﾁｹﾝ","ﾅｺﾞﾔｼﾋｶﾞｼｸ"]
[null,null,"愛知県","名古屋市北区","ｱｲﾁｹﾝ","ﾅｺﾞﾔｼｷﾀｸ"]
[null,null,"愛知県","名古屋市西区","ｱｲﾁｹﾝ","ﾅｺﾞﾔｼﾆｼｸ"]
[null,null,"愛知県","名古屋市中村区","ｱｲﾁｹﾝ","ﾅｺﾞﾔｼﾅｶﾑﾗｸ"]
[null,null,"愛知県","名古屋市中区","ｱｲﾁｹﾝ","ﾅｺﾞﾔｼﾅｶｸ"]
[null,null,"愛知県","名古屋市昭和区","ｱｲﾁｹﾝ","ﾅｺﾞﾔｼｼｮｳﾜｸ"]
[null,null,"愛知県","名古屋市瑞穂区","ｱｲﾁｹﾝ","ﾅｺﾞﾔｼﾐｽﾞﾎｸ"]
[null,null,"愛知県","名古屋市熱田区","ｱｲﾁｹﾝ","ﾅｺﾞﾔｼｱﾂﾀｸ"]
[null,null,"愛知県","名古屋市中川区","ｱｲﾁｹﾝ","ﾅｺﾞﾔｼﾅｶｶﾞﾜｸ"]
[null,null,"愛知県","名古屋市港区","ｱｲﾁｹﾝ","ﾅｺﾞﾔｼﾐﾅﾄｸ"]
[null,null,"愛知県","名古屋市南区","ｱｲﾁｹﾝ","ﾅｺﾞﾔｼﾐﾅﾐｸ"]
[null,null,"愛知県","名古屋市守山区","ｱｲﾁｹﾝ","ﾅｺﾞﾔｼﾓﾘﾔﾏｸ"]
[null,null,"愛知県","名古屋市緑区","ｱｲﾁｹﾝ","ﾅｺﾞﾔｼﾐﾄﾞﾘｸ"]
[null,null,"愛知県","名古屋市名東区","ｱｲﾁｹﾝ","ﾅｺﾞﾔｼﾒｲﾄｳｸ"]
[null,null,"愛知県","名古屋市天白区","ｱｲﾁｹﾝ","ﾅｺﾞﾔｼﾃﾝﾊﾟｸｸ"]
[null,null,"愛知県","豊橋市","ｱｲﾁｹﾝ","ﾄﾖﾊｼｼ"]
[null,null,"愛知県","岡崎市","ｱｲﾁｹﾝ","ｵｶｻﾞｷｼ"]
[null,null,"愛知県","一宮市","ｱｲﾁｹﾝ","ｲﾁﾉﾐﾔｼ"]
[null,null,"愛知県","瀬戸市","ｱｲﾁｹﾝ","ｾﾄｼ"]
[null,null,"愛知県","半田市","ｱｲﾁｹﾝ","ﾊﾝﾀﾞｼ"]
[null,null,"愛知県","春日井市","ｱｲﾁｹﾝ","ｶｽｶﾞｲｼ"]
[null,null,"愛知県","豊川市","ｱｲﾁｹﾝ","ﾄﾖｶﾜｼ"]
[null,null,"愛知県","津島市","ｱｲﾁｹﾝ","ﾂｼﾏｼ"]
[null,null,"愛知県","碧南市","ｱｲﾁｹﾝ","ﾍｷﾅﾝｼ"]
[null,null,"愛知県","刈谷市","ｱｲﾁｹﾝ","ｶﾘﾔｼ"]
[null,null,"愛知県","豊田市","ｱｲﾁｹﾝ","ﾄﾖﾀｼ"]
[null,null,"愛知県","安城市","ｱｲﾁｹﾝ","ｱﾝｼﾞｮｳｼ"]
[null,null,"愛知県","西尾市","ｱｲﾁｹﾝ","ﾆｼｵｼ"]
[null,null,"愛知県","蒲郡市","ｱｲﾁｹﾝ","ｶﾞﾏｺﾞｵﾘｼ"]
[null,null,"愛知県","犬山市","ｱｲﾁｹﾝ","ｲﾇﾔﾏｼ"]
[null,null,"愛知県","常滑市","ｱｲﾁｹﾝ","ﾄｺﾅﾒｼ"]
[null,null,"愛知県","江南市","ｱｲﾁｹﾝ","ｺｳﾅﾝｼ"]
[null,null,"愛知県","小牧市","ｱｲﾁｹﾝ","ｺﾏｷｼ"]
[null,null,"愛知県","稲沢市","ｱｲﾁｹﾝ","ｲﾅｻﾞﾜｼ"]
[null,null,"愛知県","新城市","ｱｲﾁｹﾝ","ｼﾝｼﾛｼ"]
[null,null,"愛知県","東海市","ｱｲﾁｹﾝ","ﾄｳｶｲｼ"]
[null,null,"愛知県","大府市","ｱｲﾁｹﾝ","ｵｵﾌﾞｼ"]
[null,null,"愛知県","知多市","ｱｲﾁｹﾝ","ﾁﾀｼ"]
[null,null,"愛知県","知立市","ｱｲﾁｹﾝ","ﾁﾘｭｳｼ"]
[null,null,"愛知県","尾張旭市","ｱｲﾁｹﾝ","ｵﾜﾘｱｻﾋｼ"]
[null,null,"愛知県","高浜市","ｱｲﾁｹﾝ","ﾀｶﾊﾏｼ"]
[null,null,"愛知県","岩倉市","ｱｲﾁｹﾝ","ｲﾜｸﾗｼ"]
[null,null,"愛知県","豊明市","ｱｲﾁｹﾝ","ﾄﾖｱｹｼ"]
[null,null,"愛知県","日進市","ｱｲﾁｹﾝ","ﾆｯｼﾝｼ"]
[null,null,"愛知県","田原市","ｱｲﾁｹﾝ","ﾀﾊﾗｼ"]
[null,null,"愛知県","愛西市","ｱｲﾁｹﾝ","ｱｲｻｲｼ"]
[null,null,"愛知県","清須市","ｱｲﾁｹﾝ","ｷﾖｽｼ"]
[null,null,"愛知県","北名古屋市","ｱｲﾁｹﾝ","ｷﾀﾅｺﾞﾔｼ"]
[null,null,"愛知県","弥富市","ｱｲﾁｹﾝ","ﾔﾄﾐｼ"]
[null,null,"愛知県","みよし市","ｱｲﾁｹﾝ","ﾐﾖｼｼ"]
[null,null,"愛知県","あま市","ｱｲﾁｹﾝ","ｱﾏｼ"]
[null,null,"愛知県","長久手市","ｱｲﾁｹﾝ","ﾅｶﾞｸﾃｼ"]
[null,null,"愛知県","愛知郡東郷町","ｱｲﾁｹﾝ","ｱｲﾁｸﾞﾝﾄｳｺﾞｳﾁｮｳ"]
[null,null,"愛知県","西春日井郡豊山町","ｱｲﾁｹﾝ","ﾆｼｶｽｶﾞｲｸﾞﾝﾄﾖﾔﾏﾁｮｳ"]
[null,null,"愛知県","丹羽郡大口町","ｱｲﾁｹﾝ","ﾆﾜｸﾞﾝｵｵｸﾞﾁﾁｮｳ"]
[null,null,"愛知県","丹羽郡扶桑町","ｱｲﾁｹﾝ","ﾆﾜｸﾞﾝﾌｿｳﾁｮｳ"]
[null,null,"愛知県","海部郡大治町","ｱｲﾁｹﾝ","ｱﾏｸﾞﾝｵｵﾊﾙﾁｮｳ"]
[null,null,"愛知県","海部郡蟹江町","ｱｲﾁｹﾝ","ｱﾏｸﾞﾝｶﾆｴﾁｮｳ"]
[null,null,"愛知県","海部郡飛島村","ｱｲﾁｹﾝ","ｱﾏｸﾞﾝﾄﾋﾞｼﾏﾑﾗ"]
[null,null,"愛知県","知多郡阿久比町","ｱｲﾁｹﾝ","ﾁﾀｸﾞﾝｱｸﾞｲﾁｮｳ"]
[null,null,"愛知県","知多郡東浦町","ｱｲﾁｹﾝ","ﾁﾀｸﾞﾝﾋｶﾞｼｳﾗﾁｮｳ"]
[null,null,"愛知県","知多郡南知多町","ｱｲﾁｹﾝ","ﾁﾀｸﾞﾝﾐﾅﾐﾁﾀﾁｮｳ"]
[null,null,"愛知県","知多郡美浜町","ｱｲﾁｹﾝ","ﾁﾀｸﾞﾝﾐﾊﾏﾁｮｳ"]
[null,null,"愛知県","知多郡武豊町","ｱｲﾁｹﾝ","ﾁﾀｸﾞﾝﾀｹﾄﾖﾁｮｳ"]
[null,null,"愛知県","額田郡幸田町","ｱｲﾁｹﾝ","ﾇｶﾀｸﾞﾝｺｳﾀﾁｮｳ"]
[null,null,"愛知県","北設楽郡設楽町","ｱｲﾁｹﾝ","ｷﾀｼﾀﾗｸﾞﾝｼﾀﾗﾁｮｳ"]
[null,null,"愛知県","北設楽郡東栄町","ｱｲﾁｹﾝ","ｷﾀｼﾀﾗｸﾞﾝﾄｳｴｲﾁｮｳ"]
[null,null,"愛知県","北設楽郡豊根村","ｱｲﾁｹﾝ","ｷﾀｼﾀﾗｸﾞﾝﾄﾖﾈﾑﾗ"]
[null,null,"三重県","津市","ﾐｴｹﾝ","ﾂｼ"]
[null,null,"三重県","四日市市","ﾐｴｹﾝ","ﾖｯｶｲﾁｼ"]
[null,null,"三重県","伊勢市","ﾐｴｹﾝ","ｲｾｼ"]
[null,null,"三重県","松阪市","ﾐｴｹﾝ","ﾏﾂｻｶｼ"]
[null,null,"三重県","桑名市","ﾐｴｹﾝ","ｸﾜﾅｼ"]
[null,null,"三重県","鈴鹿市","ﾐｴｹﾝ","ｽｽﾞｶｼ"]
[null,null,"三重県","名張市","ﾐｴｹﾝ","ﾅﾊﾞﾘｼ"]
[null,null,"三重県","尾鷲市","ﾐｴｹﾝ","ｵﾜｾｼ"]
[null,null,"三重県","亀山市","ﾐｴｹﾝ","ｶﾒﾔﾏｼ"]
[null,null,"三重県","鳥羽市","ﾐｴｹﾝ","ﾄﾊﾞｼ"]
[null,null,"三重県","熊野市","ﾐｴｹﾝ","ｸﾏﾉｼ"]
[null,null,"三重県","いなべ市","ﾐｴｹﾝ","ｲﾅﾍﾞｼ"]
[null,null,"三重県","志摩市","ﾐｴｹﾝ","ｼﾏｼ"]
[null,null,"三重県","伊賀市","ﾐｴｹﾝ","ｲｶﾞｼ"]
[null,null,"三重県","桑名郡木曽岬町","ﾐｴｹﾝ","ｸﾜﾅｸﾞﾝｷｿｻｷﾁｮｳ"]
[null,null,"三重県","員弁郡東員町","ﾐｴｹﾝ","ｲﾅﾍﾞｸﾞﾝﾄｳｲﾝﾁｮｳ"]
[null,null,"三重県","三重郡菰野町","ﾐｴｹﾝ","ﾐｴｸﾞﾝｺﾓﾉﾁｮｳ"]
[null,null,"三重県","三重郡朝日町","ﾐｴｹﾝ","ﾐｴｸﾞﾝｱｻﾋﾁｮｳ"]
[null,null,"三重県","三重郡川越町","ﾐｴｹﾝ","ﾐｴｸﾞﾝｶﾜｺﾞｴﾁｮｳ"]
[null,null,"三重県","多気郡多気町","ﾐｴｹﾝ","ﾀｷｸﾞﾝﾀｷﾁｮｳ"]
[null,null,"三重県","多気郡明和町","ﾐｴｹﾝ","ﾀｷｸﾞﾝﾒｲﾜﾁｮｳ"]
[null,null,"三重県","多気郡大台町","ﾐｴｹﾝ","ﾀｷｸﾞﾝｵｵﾀﾞｲﾁｮｳ"]
[null,null,"三重県","度会郡玉城町","ﾐｴｹﾝ","ﾜﾀﾗｲｸﾞﾝﾀﾏｷﾁｮｳ"]
[null,null,"三重県","度会郡度会町","ﾐｴｹﾝ","ﾜﾀﾗｲｸﾞﾝﾜﾀﾗｲﾁｮｳ"]
[null,null,"三重県","度会郡大紀町","ﾐｴｹﾝ","ﾜﾀﾗｲｸﾞﾝﾀｲｷﾁｮｳ"]
[null,null,"三重県","度会郡南伊勢町","ﾐｴｹﾝ","ﾜﾀﾗｲｸﾞﾝﾐﾅﾐｲｾﾁｮｳ"]
[null,null,"三重県","北牟婁郡紀北町","ﾐｴｹﾝ","ｷﾀﾑﾛｸﾞﾝｷﾎｸﾁｮｳ"]
[null,null,"三重県","南牟婁郡御浜町","ﾐｴｹﾝ","ﾐﾅﾐﾑﾛｸﾞﾝﾐﾊﾏﾁｮｳ"]
[null,null,"三重県","南牟婁郡紀宝町","ﾐｴｹﾝ","ﾐﾅﾐﾑﾛｸﾞﾝｷﾎｳﾁｮｳ"]
[null,null,"滋賀県","大津市","ｼｶﾞｹﾝ","ｵｵﾂｼ"]
[null,null,"滋賀県","彦根市","ｼｶﾞｹﾝ","ﾋｺﾈｼ"]
[null,null,"滋賀県","長浜市","ｼｶﾞｹﾝ","ﾅｶﾞﾊﾏｼ"]
[null,null,"滋賀県","近江八幡市","ｼｶﾞｹﾝ","ｵｳﾐﾊﾁﾏﾝｼ"]
[null,null,"滋賀県","草津市","ｼｶﾞｹﾝ","ｸｻﾂｼ"]
[null,null,"滋賀県","守山市","ｼｶﾞｹﾝ","ﾓﾘﾔﾏｼ"]
[null,null,"滋賀県","栗東市","ｼｶﾞｹﾝ","ﾘｯﾄｳｼ"]
[null,null,"滋賀県","甲賀市","ｼｶﾞｹﾝ","ｺｳｶｼ"]
[null,null,"滋賀県","野洲市","ｼｶﾞｹﾝ","ﾔｽｼ"]
[null,null,"滋賀県","湖南市","ｼｶﾞｹﾝ","ｺﾅﾝｼ"]
[null,null,"滋賀県","高島市","ｼｶﾞｹﾝ","ﾀｶｼﾏｼ"]
[null,null,"滋賀県","東近江市","ｼｶﾞｹﾝ","ﾋｶﾞｼｵｳﾐｼ"]
[null,null,"滋賀県","米原市","ｼｶﾞｹﾝ","ﾏｲﾊﾞﾗｼ"]
[null,null,"滋賀県","蒲生郡日野町","ｼｶﾞｹﾝ","ｶﾞﾓｳｸﾞﾝﾋﾉﾁｮｳ"]
[null,null,"滋賀県","蒲生郡竜王町","ｼｶﾞｹﾝ","ｶﾞﾓｳｸﾞﾝﾘｭｳｵｳﾁｮｳ"]
[null,null,"滋賀県","愛知郡愛荘町","ｼｶﾞｹﾝ","ｴﾁｸﾞﾝｱｲｼｮｳﾁｮｳ"]
[null,null,"滋賀県","犬上郡豊郷町","ｼｶﾞｹﾝ","ｲﾇｶﾐｸﾞﾝﾄﾖｻﾄﾁｮｳ"]
[null,null,"滋賀県","犬上郡甲良町","ｼｶﾞｹﾝ","ｲﾇｶﾐｸﾞﾝｺｳﾗﾁｮｳ"]
[null,null,"滋賀県","犬上郡多賀町","ｼｶﾞｹﾝ","ｲﾇｶﾐｸﾞﾝﾀｶﾞﾁｮｳ"]
[null,null,"京都府","京都市北区","ｷｮｳﾄﾌ","ｷｮｳﾄｼｷﾀｸ"]
[null,null,"京都府","京都市上京区","ｷｮｳﾄﾌ","ｷｮｳﾄｼｶﾐｷﾞｮｳｸ"]
[null,null,"京都府","京都市左京区","ｷｮｳﾄﾌ","ｷｮｳﾄｼｻｷｮｳｸ"]
[null,null,"京都府","京都市中京区","ｷｮｳﾄﾌ","ｷｮｳﾄｼﾅｶｷﾞｮｳｸ"]
[null,null,"京都府","京都市東山区","ｷｮｳﾄﾌ","ｷｮｳﾄｼﾋｶﾞｼﾔﾏｸ"]
[null,null,"京都府","京都市下京区","ｷｮｳﾄﾌ","ｷｮｳﾄｼｼﾓｷﾞｮｳｸ"]
[null,null,"京都府","京都市南区","ｷｮｳﾄﾌ","ｷｮｳﾄｼﾐﾅﾐｸ"]
[null,null,"京都府","京都市右京区","ｷｮｳﾄﾌ","ｷｮｳﾄｼｳｷｮｳｸ"]
[null,null,"京都府","京都市伏見区","ｷｮｳﾄﾌ","ｷｮｳﾄｼﾌｼﾐｸ"]
[null,null,"京都府","京都市山科区","ｷｮｳﾄﾌ","ｷｮｳﾄｼﾔﾏｼﾅｸ"]
[null,null,"京都府","京都市西京区","ｷｮｳﾄﾌ","ｷｮｳﾄｼﾆｼｷｮｳｸ"]
[null,null,"京都府","福知山市","ｷｮｳﾄﾌ","ﾌｸﾁﾔﾏｼ"]
[null,null,"京都府","舞鶴市","ｷｮｳﾄﾌ","ﾏｲﾂﾞﾙｼ"]
[null,null,"京都府","綾部市","ｷｮｳﾄﾌ","ｱﾔﾍﾞｼ"]
[null,null,"京都府","宇治市","ｷｮｳﾄﾌ","ｳｼﾞｼ"]
[null,null,"京都府","宮津市","ｷｮｳﾄﾌ","ﾐﾔﾂﾞｼ"]
[null,null,"京都府","亀岡市","ｷｮｳﾄﾌ","ｶﾒｵｶｼ"]
[null,null,"京都府","城陽市","ｷｮｳﾄﾌ","ｼﾞｮｳﾖｳｼ"]
[null,null,"京都府","向日市","ｷｮｳﾄﾌ","ﾑｺｳｼ"]
[null,null,"京都府","長岡京市","ｷｮｳﾄﾌ","ﾅｶﾞｵｶｷｮｳｼ"]
[null,null,"京都府","八幡市","ｷｮｳﾄﾌ","ﾔﾜﾀｼ"]
[null,null,"京都府","京田辺市","ｷｮｳﾄﾌ","ｷｮｳﾀﾅﾍﾞｼ"]
[null,null,"京都府","京丹後市","ｷｮｳﾄﾌ","ｷｮｳﾀﾝｺﾞｼ"]
[null,null,"京都府","南丹市","ｷｮｳﾄﾌ","ﾅﾝﾀﾝｼ"]
[null,null,"京都府","木津川市","ｷｮｳﾄﾌ","ｷﾂﾞｶﾞﾜｼ"]
[null,null,"京都府","乙訓郡大山崎町","ｷｮｳﾄﾌ","ｵﾄｸﾆｸﾞﾝｵｵﾔﾏｻﾞｷﾁｮｳ"]
[null,null,"京都府","久世郡久御山町","ｷｮｳﾄﾌ","ｸｾｸﾞﾝｸﾐﾔﾏﾁｮｳ"]
[null,null,"京都府","綴喜郡井手町","ｷｮｳﾄﾌ","ﾂﾂﾞｷｸﾞﾝｲﾃﾞﾁｮｳ"]
[null,null,"京都府","綴喜郡宇治田原町","ｷｮｳﾄﾌ","ﾂﾂﾞｷｸﾞﾝｳｼﾞﾀﾜﾗﾁｮｳ"]
[null,null,"京都府","相楽郡笠置町","ｷｮｳﾄﾌ","ｿｳﾗｸｸﾞﾝｶｻｷﾞﾁｮｳ"]
[null,null,"京都府","相楽郡和束町","ｷｮｳﾄﾌ","ｿｳﾗｸｸﾞﾝﾜﾂﾞｶﾁｮｳ"]
[null,null,"京都府","相楽郡精華町","ｷｮｳﾄﾌ","ｿｳﾗｸｸﾞﾝｾｲｶﾁｮｳ"]
[null,null,"京都府","相楽郡南山城村","ｷｮｳﾄﾌ","ｿｳﾗｸｸﾞﾝﾐﾅﾐﾔﾏｼﾛﾑﾗ"]
[null,null,"京都府","船井郡京丹波町","ｷｮｳﾄﾌ","ﾌﾅｲｸﾞﾝｷｮｳﾀﾝﾊﾞﾁｮｳ"]
[null,null,"京都府","与謝郡伊根町","ｷｮｳﾄﾌ","ﾖｻｸﾞﾝｲﾈﾁｮｳ"]
[null,null,"京都府","与謝郡与謝野町","ｷｮｳﾄﾌ","ﾖｻｸﾞﾝﾖｻﾉﾁｮｳ"]
[null,null,"大阪府","大阪市都島区","ｵｵｻｶﾌ","ｵｵｻｶｼﾐﾔｺｼﾞﾏｸ"]
[null,null,"大阪府","大阪市福島区","ｵｵｻｶﾌ","ｵｵｻｶｼﾌｸｼﾏｸ"]
[null,null,"大阪府","大阪市此花区","ｵｵｻｶﾌ","ｵｵｻｶｼｺﾉﾊﾅｸ"]
[null,null,"大阪府","大阪市西区","ｵｵｻｶﾌ","ｵｵｻｶｼﾆｼｸ"]
[null,null,"大阪府","大阪市港区","ｵｵｻｶﾌ","ｵｵｻｶｼﾐﾅﾄｸ"]
[null,null,"大阪府","大阪市大正区","ｵｵｻｶﾌ","ｵｵｻｶｼﾀｲｼｮｳｸ"]
[null,null,"大阪府","大阪市天王寺区","ｵｵｻｶﾌ","ｵｵｻｶｼﾃﾝﾉｳｼﾞｸ"]
[null,null,"大阪府","大阪市浪速区","ｵｵｻｶﾌ","ｵｵｻｶｼﾅﾆﾜｸ"]
[null,null,"大阪府","大阪市西淀川区","ｵｵｻｶﾌ","ｵｵｻｶｼﾆｼﾖﾄﾞｶﾞﾜｸ"]
[null,null,"大阪府","大阪市東淀川区","ｵｵｻｶﾌ","ｵｵｻｶｼﾋｶﾞｼﾖﾄﾞｶﾞﾜｸ"]
[null,null,"大阪府","大阪市東成区","ｵｵｻｶﾌ","ｵｵｻｶｼﾋｶﾞｼﾅﾘｸ"]
[null,null,"大阪府","大阪市生野区","ｵｵｻｶﾌ","ｵｵｻｶｼｲｸﾉｸ"]
[null,null,"大阪府","大阪市旭区","ｵｵｻｶﾌ","ｵｵｻｶｼｱｻﾋｸ"]
[null,null,"大阪府","大阪市城東区","ｵｵｻｶﾌ","ｵｵｻｶｼｼﾞｮｳﾄｳｸ"]
[null,null,"大阪府","大阪市阿倍野区","ｵｵｻｶﾌ","ｵｵｻｶｼｱﾍﾞﾉｸ"]
[null,null,"大阪府","大阪市住吉区","ｵｵｻｶﾌ","ｵｵｻｶｼｽﾐﾖｼｸ"]
[null,null,"大阪府","大阪市東住吉区","ｵｵｻｶﾌ","ｵｵｻｶｼﾋｶﾞｼｽﾐﾖｼｸ"]
[null,null,"大阪府","大阪市西成区","ｵｵｻｶﾌ","ｵｵｻｶｼﾆｼﾅﾘｸ"]
[null,null,"大阪府","大阪市淀川区","ｵｵｻｶﾌ","ｵｵｻｶｼﾖﾄﾞｶﾞﾜｸ"]
[null,null,"大阪府","大阪市鶴見区","ｵｵｻｶﾌ","ｵｵｻｶｼﾂﾙﾐｸ"]
[null,null,"大阪府","大阪市住之江区","ｵｵｻｶﾌ","ｵｵｻｶｼｽﾐﾉｴｸ"]
[null,null,"大阪府","大阪市平野区","ｵｵｻｶﾌ","ｵｵｻｶｼﾋﾗﾉｸ"]
[null,null,"大阪府","大阪市北区","ｵｵｻｶﾌ","ｵｵｻｶｼｷﾀｸ"]
[null,null,"大阪府","大阪市中央区","ｵｵｻｶﾌ","ｵｵｻｶｼﾁｭｳｵｳｸ"]
[null,null,"大阪府","堺市堺区","ｵｵｻｶﾌ","ｻｶｲｼｻｶｲｸ"]
[null,null,"大阪府","堺市中区","ｵｵｻｶﾌ","ｻｶｲｼﾅｶｸ"]
[null,null,"大阪府","堺市東区","ｵｵｻｶﾌ","ｻｶｲｼﾋｶﾞｼｸ"]
[null,null,"大阪府","堺市西区","ｵｵｻｶﾌ","ｻｶｲｼﾆｼｸ"]
[null,null,"大阪府","堺市南区","ｵｵｻｶﾌ","ｻｶｲｼﾐﾅﾐｸ"]
[null,null,"大阪府","堺市北区","ｵｵｻｶﾌ","ｻｶｲｼｷﾀｸ"]
[null,null,"大阪府","堺市美原区","ｵｵｻｶﾌ","ｻｶｲｼﾐﾊﾗｸ"]
[null,null,"大阪府","岸和田市","ｵｵｻｶﾌ","ｷｼﾜﾀﾞｼ"]
[null,null,"大阪府","豊中市","ｵｵｻｶﾌ","ﾄﾖﾅｶｼ"]
[null,null,"大阪府","池田市","ｵｵｻｶﾌ","ｲｹﾀﾞｼ"]
[null,null,"大阪府","吹田市","ｵｵｻｶﾌ","ｽｲﾀｼ"]
[null,null,"大阪府","泉大津市","ｵｵｻｶﾌ","ｲｽﾞﾐｵｵﾂｼ"]
[null,null,"大阪府","高槻市","ｵｵｻｶﾌ","ﾀｶﾂｷｼ"]
[null,null,"大阪府","貝塚市","ｵｵｻｶﾌ","ｶｲﾂﾞｶｼ"]
[null,null,"大阪府","守口市","ｵｵｻｶﾌ","ﾓﾘｸﾞﾁｼ"]
[null,null,"大阪府","枚方市","ｵｵｻｶﾌ","ﾋﾗｶﾀｼ"]
[null,null,"大阪府","茨木市","ｵｵｻｶﾌ","ｲﾊﾞﾗｷｼ"]
[null,null,"大阪府","八尾市","ｵｵｻｶﾌ","ﾔｵｼ"]
[null,null,"大阪府","泉佐野市","ｵｵｻｶﾌ","ｲｽﾞﾐｻﾉｼ"]
[null,null,"大阪府","富田林市","ｵｵｻｶﾌ","ﾄﾝﾀﾞﾊﾞﾔｼｼ"]
[null,null,"大阪府","寝屋川市","ｵｵｻｶﾌ","ﾈﾔｶﾞﾜｼ"]
[null,null,"大阪府","河内長野市","ｵｵｻｶﾌ","ｶﾜﾁﾅｶﾞﾉｼ"]
[null,null,"大阪府","松原市","ｵｵｻｶﾌ","ﾏﾂﾊﾞﾗｼ"]
[null,null,"大阪府","大東市","ｵｵｻｶﾌ","ﾀﾞｲﾄｳｼ"]
[null,null,"大阪府","和泉市","ｵｵｻｶﾌ","ｲｽﾞﾐｼ"]
[null,null,"大阪府","箕面市","ｵｵｻｶﾌ","ﾐﾉｵｼ"]
[null,null,"大阪府","柏原市","ｵｵｻｶﾌ","ｶｼﾜﾗｼ"]
[null,null,"大阪府","羽曳野市","ｵｵｻｶﾌ","ﾊﾋﾞｷﾉｼ"]
[null,null,"大阪府","門真市","ｵｵｻｶﾌ","ｶﾄﾞﾏｼ"]
[null,null,"大阪府","摂津市","ｵｵｻｶﾌ","ｾｯﾂｼ"]
[null,null,"大阪府","高石市","ｵｵｻｶﾌ","ﾀｶｲｼｼ"]
[null,null,"大阪府","藤井寺市","ｵｵｻｶﾌ","ﾌｼﾞｲﾃﾞﾗｼ"]
[null,null,"大阪府","東大阪市","ｵｵｻｶﾌ","ﾋｶﾞｼｵｵｻｶｼ"]
[null,null,"大阪府","泉南市","ｵｵｻｶﾌ","ｾﾝﾅﾝｼ"]
[null,null,"大阪府","四條畷市","ｵｵｻｶﾌ","ｼｼﾞｮｳﾅﾜﾃｼ"]
[null,null,"大阪府","交野市","ｵｵｻｶﾌ","ｶﾀﾉｼ"]
[null,null,"大阪府","大阪狭山市","ｵｵｻｶﾌ","ｵｵｻｶｻﾔﾏｼ"]
[null,null,"大阪府","阪南市","ｵｵｻｶﾌ","ﾊﾝﾅﾝｼ"]
[null,null,"大阪府","三島郡島本町","ｵｵｻｶﾌ","ﾐｼﾏｸﾞﾝｼﾏﾓﾄﾁｮｳ"]
[null,null,"大阪府","豊能郡豊能町","ｵｵｻｶﾌ","ﾄﾖﾉｸﾞﾝﾄﾖﾉﾁｮｳ"]
[null,null,"大阪府","豊能郡能勢町","ｵｵｻｶﾌ","ﾄﾖﾉｸﾞﾝﾉｾﾁｮｳ"]
[null,null,"大阪府","泉北郡忠岡町","ｵｵｻｶﾌ","ｾﾝﾎﾞｸｸﾞﾝﾀﾀﾞｵｶﾁｮｳ"]
[null,null,"大阪府","泉南郡熊取町","ｵｵｻｶﾌ","ｾﾝﾅﾝｸﾞﾝｸﾏﾄﾘﾁｮｳ"]
[null,null,"大阪府","泉南郡田尻町","ｵｵｻｶﾌ","ｾﾝﾅﾝｸﾞﾝﾀｼﾞﾘﾁｮｳ"]
[null,null,"大阪府","泉南郡岬町","ｵｵｻｶﾌ","ｾﾝﾅﾝｸﾞﾝﾐｻｷﾁｮｳ"]
[null,null,"大阪府","南河内郡太子町","ｵｵｻｶﾌ","ﾐﾅﾐｶﾜﾁｸﾞﾝﾀｲｼﾁｮｳ"]
[null,null,"大阪府","南河内郡河南町","ｵｵｻｶﾌ","ﾐﾅﾐｶﾜﾁｸﾞﾝｶﾅﾝﾁｮｳ"]
[null,null,"大阪府","南河内郡千早赤阪村","ｵｵｻｶﾌ","ﾐﾅﾐｶﾜﾁｸﾞﾝﾁﾊﾔｱｶｻｶﾑﾗ"]
[null,null,"兵庫県","神戸市東灘区","ﾋｮｳｺﾞｹﾝ","ｺｳﾍﾞｼﾋｶﾞｼﾅﾀﾞｸ"]
[null,null,"兵庫県","神戸市灘区","ﾋｮｳｺﾞｹﾝ","ｺｳﾍﾞｼﾅﾀﾞｸ"]
[null,null,"兵庫県","神戸市兵庫区","ﾋｮｳｺﾞｹﾝ","ｺｳﾍﾞｼﾋｮｳｺﾞｸ"]
[null,null,"兵庫県","神戸市長田区","ﾋｮｳｺﾞｹﾝ","ｺｳﾍﾞｼﾅｶﾞﾀｸ"]
[null,null,"兵庫県","神戸市須磨区","ﾋｮｳｺﾞｹﾝ","ｺｳﾍﾞｼｽﾏｸ"]
[null,null,"兵庫県","神戸市垂水区","ﾋｮｳｺﾞｹﾝ","ｺｳﾍﾞｼﾀﾙﾐｸ"]
[null,null,"兵庫県","神戸市北区","ﾋｮｳｺﾞｹﾝ","ｺｳﾍﾞｼｷﾀｸ"]
[null,null,"兵庫県","神戸市中央区","ﾋｮｳｺﾞｹﾝ","ｺｳﾍﾞｼﾁｭｳｵｳｸ"]
[null,null,"兵庫県","神戸市西区","ﾋｮｳｺﾞｹﾝ","ｺｳﾍﾞｼﾆｼｸ"]
[null,null,"兵庫県","姫路市","ﾋｮｳｺﾞｹﾝ","ﾋﾒｼﾞｼ"]
[null,null,"兵庫県","尼崎市","ﾋｮｳｺﾞｹﾝ","ｱﾏｶﾞｻｷｼ"]
[null,null,"兵庫県","明石市","ﾋｮｳｺﾞｹﾝ","ｱｶｼｼ"]
[null,null,"兵庫県","西宮市","ﾋｮｳｺﾞｹﾝ","ﾆｼﾉﾐﾔｼ"]
[null,null,"兵庫県","洲本市","ﾋｮｳｺﾞｹﾝ","ｽﾓﾄｼ"]
[null,null,"兵庫県","芦屋市","ﾋｮｳｺﾞｹﾝ","ｱｼﾔｼ"]
[null,null,"兵庫県","伊丹市","ﾋｮｳｺﾞｹﾝ","ｲﾀﾐｼ"]
[null,null,"兵庫県","相生市","ﾋｮｳｺﾞｹﾝ","ｱｲｵｲｼ"]
[null,null,"兵庫県","豊岡市","ﾋｮｳｺﾞｹﾝ","ﾄﾖｵｶｼ"]
[null,null,"兵庫県","加古川市","ﾋｮｳｺﾞｹﾝ","ｶｺｶﾞﾜｼ"]
[null,null,"兵庫県","赤穂市","ﾋｮｳｺﾞｹﾝ","ｱｺｳｼ"]
[null,null,"兵庫県","西脇市","ﾋｮｳｺﾞｹﾝ","ﾆｼﾜｷｼ"]
[null,null,"兵庫県","宝塚市","ﾋｮｳｺﾞｹﾝ","ﾀｶﾗﾂﾞｶｼ"]
[null,null,"兵庫県","三木市","ﾋｮｳｺﾞｹﾝ","ﾐｷｼ"]
[null,null,"兵庫県","高砂市","ﾋｮｳｺﾞｹﾝ","ﾀｶｻｺﾞｼ"]
[null,null,"兵庫県","川西市","ﾋｮｳｺﾞｹﾝ","ｶﾜﾆｼｼ"]
[null,null,"兵庫県","小野市","ﾋｮｳｺﾞｹﾝ","ｵﾉｼ"]
[null,null,"兵庫県","三田市","ﾋｮｳｺﾞｹﾝ","ｻﾝﾀﾞｼ"]
[null,null,"兵庫県","加西市","ﾋｮｳｺﾞｹﾝ","ｶｻｲｼ"]
[null,null,"兵庫県","丹波篠山市","ﾋｮｳｺﾞｹﾝ","ﾀﾝﾊﾞｻｻﾔﾏｼ"]
[null,null,"兵庫県","養父市","ﾋｮｳｺﾞｹﾝ","ﾔﾌﾞｼ"]
[null,null,"兵庫県","丹波市","ﾋｮｳｺﾞｹﾝ","ﾀﾝﾊﾞｼ"]
[null,null,"兵庫県","南あわじ市","ﾋｮｳｺﾞｹﾝ","ﾐﾅﾐｱﾜｼﾞｼ"]
[null,null,"兵庫県","朝来市","ﾋｮｳｺﾞｹﾝ","ｱｻｺﾞｼ"]
[null,null,"兵庫県","淡路市","ﾋｮｳｺﾞｹﾝ","ｱﾜｼﾞｼ"]
[null,null,"兵庫県","宍粟市","ﾋｮｳｺﾞｹﾝ","ｼｿｳｼ"]
[null,null,"兵庫県","加東市","ﾋｮｳｺﾞｹﾝ","ｶﾄｳｼ"]
[null,null,"兵庫県","たつの市","ﾋｮｳｺﾞｹﾝ","ﾀﾂﾉｼ"]
[null,null,"兵庫県","川辺郡猪名川町","ﾋｮｳｺﾞｹﾝ","ｶﾜﾍﾞｸﾞﾝｲﾅｶﾞﾜﾁｮｳ"]
[null,null,"兵庫県","多可郡多可町","ﾋｮｳｺﾞｹﾝ","ﾀｶｸﾞﾝﾀｶﾁｮｳ"]
[null,null,"兵庫県","加古郡稲美町","ﾋｮｳｺﾞｹﾝ","ｶｺｸﾞﾝｲﾅﾐﾁｮｳ"]
[null,null,"兵庫県","加古郡播磨町","ﾋｮｳｺﾞｹﾝ","ｶｺｸﾞﾝﾊﾘﾏﾁｮｳ"]
[null,null,"兵庫県","神崎郡市川町","ﾋｮｳｺﾞｹﾝ","ｶﾝｻﾞｷｸﾞﾝｲﾁｶﾜﾁｮｳ"]
[null,null,"兵庫県","神崎郡福崎町","ﾋｮｳｺﾞｹﾝ","ｶﾝｻﾞｷｸﾞﾝﾌｸｻｷﾁｮｳ"]
[null,null,"兵庫県","神崎郡神河町","ﾋｮｳｺﾞｹﾝ","ｶﾝｻﾞｷｸﾞﾝｶﾐｶﾜﾁｮｳ"]
[null,null,"兵庫県","揖保郡太子町","ﾋｮｳｺﾞｹﾝ","ｲﾎﾞｸﾞﾝﾀｲｼﾁｮｳ"]
[null,null,"兵庫県","赤穂郡上郡町","ﾋｮｳｺﾞｹﾝ","ｱｺｳｸﾞﾝｶﾐｺﾞｵﾘﾁｮｳ"]
[null,null,"兵庫県","佐用郡佐用町","ﾋｮｳｺﾞｹﾝ","ｻﾖｳｸﾞﾝｻﾖｳﾁｮｳ"]
[null,null,"兵庫県","美方郡香美町","ﾋｮｳｺﾞｹﾝ","ﾐｶﾀｸﾞﾝｶﾐﾁｮｳ"]
[null,null,"兵庫県","美方郡新温泉町","ﾋｮｳｺﾞｹﾝ","ﾐｶﾀｸﾞﾝｼﾝｵﾝｾﾝﾁｮｳ"]
[null,null,"奈良県","奈良市","ﾅﾗｹﾝ","ﾅﾗｼ"]
[null,null,"奈良県","大和高田市","ﾅﾗｹﾝ","ﾔﾏﾄﾀｶﾀﾞｼ"]
[null,null,"奈良県","大和郡山市","ﾅﾗｹﾝ","ﾔﾏﾄｺｵﾘﾔﾏｼ"]
[null,null,"奈良県","天理市","ﾅﾗｹﾝ","ﾃﾝﾘｼ"]
[null,null,"奈良県","橿原市","ﾅﾗｹﾝ","ｶｼﾊﾗｼ"]
[null,null,"奈良県","桜井市","ﾅﾗｹﾝ","ｻｸﾗｲｼ"]
[null,null,"奈良県","五條市","ﾅﾗｹﾝ","ｺﾞｼﾞｮｳｼ"]
[null,null,"奈良県","御所市","ﾅﾗｹﾝ","ｺﾞｾｼ"]
[null,null,"奈良県","生駒市","ﾅﾗｹﾝ","ｲｺﾏｼ"]
[null,null,"奈良県","香芝市","ﾅﾗｹﾝ","ｶｼﾊﾞｼ"]
[null,null,"奈良県","葛城市","ﾅﾗｹﾝ","ｶﾂﾗｷﾞｼ"]
[null,null,"奈良県","宇陀市","ﾅﾗｹﾝ","ｳﾀﾞｼ"]
[null,null,"奈良県","山辺郡山添村","ﾅﾗｹﾝ","ﾔﾏﾍﾞｸﾞﾝﾔﾏｿﾞｴﾑﾗ"]
[null,null,"奈良県","生駒郡平群町","ﾅﾗｹﾝ","ｲｺﾏｸﾞﾝﾍｸﾞﾘﾁｮｳ"]
[null,null,"奈良県","生駒郡三郷町","ﾅﾗｹﾝ","ｲｺﾏｸﾞﾝｻﾝｺﾞｳﾁｮｳ"]
[null,null,"奈良県","生駒郡斑鳩町","ﾅﾗｹﾝ","ｲｺﾏｸﾞﾝｲｶﾙｶﾞﾁｮｳ"]
[null,null,"奈良県","生駒郡安堵町","ﾅﾗｹﾝ","ｲｺﾏｸﾞﾝｱﾝﾄﾞﾁｮｳ"]
[null,null,"奈良県","磯城郡川西町","ﾅﾗｹﾝ","ｼｷｸﾞﾝｶﾜﾆｼﾁｮｳ"]
[null,null,"奈良県","磯城郡三宅町","ﾅﾗｹﾝ","ｼｷｸﾞﾝﾐﾔｹﾁｮｳ"]
[null,null,"奈良県","磯城郡田原本町","ﾅﾗｹﾝ","ｼｷｸﾞﾝﾀﾜﾗﾓﾄﾁｮｳ"]
[null,null,"奈良県","宇陀郡曽爾村","ﾅﾗｹﾝ","ｳﾀﾞｸﾞﾝｿﾆﾑﾗ"]
[null,null,"奈良県","宇陀郡御杖村","ﾅﾗｹﾝ","ｳﾀﾞｸﾞﾝﾐﾂｴﾑﾗ"]
[null,null,"奈良県","高市郡高取町","ﾅﾗｹﾝ","ﾀｶｲﾁｸﾞﾝﾀｶﾄﾘﾁｮｳ"]
[null,null,"奈良県","高市郡明日香村","ﾅﾗｹﾝ","ﾀｶｲﾁｸﾞﾝｱｽｶﾑﾗ"]
[null,null,"奈良県","北葛城郡上牧町","ﾅﾗｹﾝ","ｷﾀｶﾂﾗｷﾞｸﾞﾝｶﾝﾏｷﾁｮｳ"]
[null,null,"奈良県","北葛城郡王寺町","ﾅﾗｹﾝ","ｷﾀｶﾂﾗｷﾞｸﾞﾝｵｳｼﾞﾁｮｳ"]
[null,null,"奈良県","北葛城郡広陵町","ﾅﾗｹﾝ","ｷﾀｶﾂﾗｷﾞｸﾞﾝｺｳﾘｮｳﾁｮｳ"]
[null,null,"奈良県","北葛城郡河合町","ﾅﾗｹﾝ","ｷﾀｶﾂﾗｷﾞｸﾞﾝｶﾜｲﾁｮｳ"]
[null,null,"奈良県","吉野郡吉野町","ﾅﾗｹﾝ","ﾖｼﾉｸﾞﾝﾖｼﾉﾁｮｳ"]
[null,null,"奈良県","吉野郡大淀町","ﾅﾗｹﾝ","ﾖｼﾉｸﾞﾝｵｵﾖﾄﾞﾁｮｳ"]
[null,null,"奈良県","吉野郡下市町","ﾅﾗｹﾝ","ﾖｼﾉｸﾞﾝｼﾓｲﾁﾁｮｳ"]
[null,null,"奈良県","吉野郡黒滝村","ﾅﾗｹﾝ","ﾖｼﾉｸﾞﾝｸﾛﾀｷﾑﾗ"]
[null,null,"奈良県","吉野郡天川村","ﾅﾗｹﾝ","ﾖｼﾉｸﾞﾝﾃﾝｶﾜﾑﾗ"]
[null,null,"奈良県","吉野郡野迫川村","ﾅﾗｹﾝ","ﾖｼﾉｸﾞﾝﾉｾｶﾞﾜﾑﾗ"]
[null,null,"奈良県","吉野郡十津川村","ﾅﾗｹﾝ","ﾖｼﾉｸﾞﾝﾄﾂｶﾜﾑﾗ"]
[null,null,"奈良県","吉野郡下北山村","ﾅﾗｹﾝ","ﾖｼﾉｸﾞﾝｼﾓｷﾀﾔﾏﾑﾗ"]
[null,null,"奈良県","吉野郡上北山村","ﾅﾗｹﾝ","ﾖｼﾉｸﾞﾝｶﾐｷﾀﾔﾏﾑﾗ"]
[null,null,"奈良県","吉野郡川上村","ﾅﾗｹﾝ","ﾖｼﾉｸﾞﾝｶﾜｶﾐﾑﾗ"]
[null,null,"奈良県","吉野郡東吉野村","ﾅﾗｹﾝ","ﾖｼﾉｸﾞﾝﾋｶﾞｼﾖｼﾉﾑﾗ"]
[null,null,"和歌山県","和歌山市","ﾜｶﾔﾏｹﾝ","ﾜｶﾔﾏｼ"]
[null,null,"和歌山県","海南市","ﾜｶﾔﾏｹﾝ","ｶｲﾅﾝｼ"]
[null,null,"和歌山県","橋本市","ﾜｶﾔﾏｹﾝ","ﾊｼﾓﾄｼ"]
[null,null,"和歌山県","有田市","ﾜｶﾔﾏｹﾝ","ｱﾘﾀﾞｼ"]
[null,null,"和歌山県","御坊市","ﾜｶﾔﾏｹﾝ","ｺﾞﾎﾞｳｼ"]
[null,null,"和歌山県","田辺市","ﾜｶﾔﾏｹﾝ","ﾀﾅﾍﾞｼ"]
[null,null,"和歌山県","新宮市","ﾜｶﾔﾏｹﾝ","ｼﾝｸﾞｳｼ"]
[null,null,"和歌山県","紀の川市","ﾜｶﾔﾏｹﾝ","ｷﾉｶﾜｼ"]
[null,null,"和歌山県","岩出市","ﾜｶﾔﾏｹﾝ","ｲﾜﾃﾞｼ"]
[null,null,"和歌山県","海草郡紀美野町","ﾜｶﾔﾏｹﾝ","ｶｲｿｳｸﾞﾝｷﾐﾉﾁｮｳ"]
[null,null,"和歌山県","伊都郡かつらぎ町","ﾜｶﾔﾏｹﾝ","ｲﾄｸﾞﾝｶﾂﾗｷﾞﾁｮｳ"]
[null,null,"和歌山県","伊都郡九度山町","ﾜｶﾔﾏｹﾝ","ｲﾄｸﾞﾝｸﾄﾞﾔﾏﾁｮｳ"]
[null,null,"和歌山県","伊都郡高野町","ﾜｶﾔﾏｹﾝ","ｲﾄｸﾞﾝｺｳﾔﾁｮｳ"]
[null,null,"和歌山県","有田郡湯浅町","ﾜｶﾔﾏｹﾝ","ｱﾘﾀﾞｸﾞﾝﾕｱｻﾁｮｳ"]
[null,null,"和歌山県","有田郡広川町","ﾜｶﾔﾏｹﾝ","ｱﾘﾀﾞｸﾞﾝﾋﾛｶﾞﾜﾁｮｳ"]
[null,null,"和歌山県","有田郡有田川町","ﾜｶﾔﾏｹﾝ","ｱﾘﾀﾞｸﾞﾝｱﾘﾀﾞｶﾞﾜﾁｮｳ"]
[null,null,"和歌山県","日高郡美浜町","ﾜｶﾔﾏｹﾝ","ﾋﾀﾞｶｸﾞﾝﾐﾊﾏﾁｮｳ"]
[null,null,"和歌山県","日高郡日高町","ﾜｶﾔﾏｹﾝ","ﾋﾀﾞｶｸﾞﾝﾋﾀﾞｶﾁｮｳ"]
[null,null,"和歌山県","日高郡由良町","ﾜｶﾔﾏｹﾝ","ﾋﾀﾞｶｸﾞﾝﾕﾗﾁｮｳ"]
[null,null,"和歌山県","日高郡印南町","ﾜｶﾔﾏｹﾝ","ﾋﾀﾞｶｸﾞﾝｲﾅﾐﾁｮｳ"]
[null,null,"和歌山県","日高郡みなべ町","ﾜｶﾔﾏｹﾝ","ﾋﾀﾞｶｸﾞﾝﾐﾅﾍﾞﾁｮｳ"]
[null,null,"和歌山県","日高郡日高川町","ﾜｶﾔﾏｹﾝ","ﾋﾀﾞｶｸﾞﾝﾋﾀﾞｶｶﾞﾜﾁｮｳ"]
[null,null,"和歌山県","西牟婁郡白浜町","ﾜｶﾔﾏｹﾝ","ﾆｼﾑﾛｸﾞﾝｼﾗﾊﾏﾁｮｳ"]
[null,null,"和歌山県","西牟婁郡上富田町","ﾜｶﾔﾏｹﾝ","ﾆｼﾑﾛｸﾞﾝｶﾐﾄﾝﾀﾞﾁｮｳ"]
[null,null,"和歌山県","西牟婁郡すさみ町","ﾜｶﾔﾏｹﾝ","ﾆｼﾑﾛｸﾞﾝｽｻﾐﾁｮｳ"]
[null,null,"和歌山県","東牟婁郡那智勝浦町","ﾜｶﾔﾏｹﾝ","ﾋｶﾞｼﾑﾛｸﾞﾝﾅﾁｶﾂｳﾗﾁｮｳ"]
[null,null,"和歌山県","東牟婁郡太地町","ﾜｶﾔﾏｹﾝ","ﾋｶﾞｼﾑﾛｸﾞﾝﾀｲｼﾞﾁｮｳ"]
[null,null,"和歌山県","東牟婁郡古座川町","ﾜｶﾔﾏｹﾝ","ﾋｶﾞｼﾑﾛｸﾞﾝｺｻﾞｶﾞﾜﾁｮｳ"]
[null,null,"和歌山県","東牟婁郡北山村","ﾜｶﾔﾏｹﾝ","ﾋｶﾞｼﾑﾛｸﾞﾝｷﾀﾔﾏﾑﾗ"]
[null,null,"和歌山県","東牟婁郡串本町","ﾜｶﾔﾏｹﾝ","ﾋｶﾞｼﾑﾛｸﾞﾝｸｼﾓﾄﾁｮｳ"]
[null,null,"鳥取県","鳥取市","ﾄｯﾄﾘｹﾝ","ﾄｯﾄﾘｼ"]
[null,null,"鳥取県","米子市","ﾄｯﾄﾘｹﾝ","ﾖﾅｺﾞｼ"]
[null,null,"鳥取県","倉吉市","ﾄｯﾄﾘｹﾝ","ｸﾗﾖｼｼ"]
[null,null,"鳥取県","境港市","ﾄｯﾄﾘｹﾝ","ｻｶｲﾐﾅﾄｼ"]
[null,null,"鳥取県","岩美郡岩美町","ﾄｯﾄﾘｹﾝ","ｲﾜﾐｸﾞﾝｲﾜﾐﾁｮｳ"]
[null,null,"鳥取県","八頭郡若桜町","ﾄｯﾄﾘｹﾝ","ﾔｽﾞｸﾞﾝﾜｶｻﾁｮｳ"]
[null,null,"鳥取県","八頭郡智頭町","ﾄｯﾄﾘｹﾝ","ﾔｽﾞｸﾞﾝﾁﾂﾞﾁｮｳ"]
[null,null,"鳥取県","八頭郡八頭町","ﾄｯﾄﾘｹﾝ","ﾔｽﾞｸﾞﾝﾔｽﾞﾁｮｳ"]
[null,null,"鳥取県","東伯郡三朝町","ﾄｯﾄﾘｹﾝ","ﾄｳﾊｸｸﾞﾝﾐｻｻﾁｮｳ"]
[null,null,"鳥取県","東伯郡湯梨浜町","ﾄｯﾄﾘｹﾝ","ﾄｳﾊｸｸﾞﾝﾕﾘﾊﾏﾁｮｳ"]
[null,null,"鳥取県","東伯郡琴浦町","ﾄｯﾄﾘｹﾝ","ﾄｳﾊｸｸﾞﾝｺﾄｳﾗﾁｮｳ"]
[null,null,"鳥取県","東伯郡北栄町","ﾄｯﾄﾘｹﾝ","ﾄｳﾊｸｸﾞﾝﾎｸｴｲﾁｮｳ"]
[null,null,"鳥取県","西伯郡日吉津村","ﾄｯﾄﾘｹﾝ","ｻｲﾊｸｸﾞﾝﾋｴﾂﾞｿﾝ"]
[null,null,"鳥取県","西伯郡大山町","ﾄｯﾄﾘｹﾝ","ｻｲﾊｸｸﾞﾝﾀﾞｲｾﾝﾁｮｳ"]
[null,null,"鳥取県","西伯郡南部町","ﾄｯﾄﾘｹﾝ","ｻｲﾊｸｸﾞﾝﾅﾝﾌﾞﾁｮｳ"]
[null,null,"鳥取県","西伯郡伯耆町","ﾄｯﾄﾘｹﾝ","ｻｲﾊｸｸﾞﾝﾎｳｷﾁｮｳ"]
[null,null,"鳥取県","日野郡日南町","ﾄｯﾄﾘｹﾝ","ﾋﾉｸﾞﾝﾆﾁﾅﾝﾁｮｳ"]
[null,null,"鳥取県","日野郡日野町","ﾄｯﾄﾘｹﾝ","ﾋﾉｸﾞﾝﾋﾉﾁｮｳ"]
[null,null,"鳥取県","日野郡江府町","ﾄｯﾄﾘｹﾝ","ﾋﾉｸﾞﾝｺｳﾌﾁｮｳ"]
[null,null,"島根県","松江市","ｼﾏﾈｹﾝ","ﾏﾂｴｼ"]
[null,null,"島根県","浜田市","ｼﾏﾈｹﾝ","ﾊﾏﾀﾞｼ"]
[null,null,"島根県","出雲市","ｼﾏﾈｹﾝ","ｲｽﾞﾓｼ"]
[null,null,"島根県","益田市","ｼﾏﾈｹﾝ","ﾏｽﾀﾞｼ"]
[null,null,"島根県","大田市","ｼﾏﾈｹﾝ","ｵｵﾀﾞｼ"]
[null,null,"島根県","安来市","ｼﾏﾈｹﾝ","ﾔｽｷﾞｼ"]
[null,null,"島根県","江津市","ｼﾏﾈｹﾝ","ｺﾞｳﾂｼ"]
[null,null,"島根県","雲南市","ｼﾏﾈｹﾝ","ｳﾝﾅﾝｼ"]
[null,null,"島根県","仁多郡奥出雲町","ｼﾏﾈｹﾝ","ﾆﾀｸﾞﾝｵｸｲｽﾞﾓﾁｮｳ"]
[null,null,"島根県","飯石郡飯南町","ｼﾏﾈｹﾝ","ｲｲｼｸﾞﾝｲｲﾅﾝﾁｮｳ"]
[null,null,"島根県","邑智郡川本町","ｼﾏﾈｹﾝ","ｵｵﾁｸﾞﾝｶﾜﾓﾄﾏﾁ"]
[null,null,"島根県","邑智郡美郷町","ｼﾏﾈｹﾝ","ｵｵﾁｸﾞﾝﾐｻﾄﾁｮｳ"]
[null,null,"島根県","邑智郡邑南町","ｼﾏﾈｹﾝ","ｵｵﾁｸﾞﾝｵｵﾅﾝﾁｮｳ"]
[null,null,"島根県","鹿足郡津和野町","ｼﾏﾈｹﾝ","ｶﾉｱｼｸﾞﾝﾂﾜﾉﾁｮｳ"]
[null,null,"島根県","鹿足郡吉賀町","ｼﾏﾈｹﾝ","ｶﾉｱｼｸﾞﾝﾖｼｶﾁｮｳ"]
[null,null,"島根県","隠岐郡海士町","ｼﾏﾈｹﾝ","ｵｷｸﾞﾝｱﾏﾁｮｳ"]
[null,null,"島根県","隠岐郡西ノ島町","ｼﾏﾈｹﾝ","ｵｷｸﾞﾝﾆｼﾉｼﾏﾁｮｳ"]
[null,null,"島根県","隠岐郡知夫村","ｼﾏﾈｹﾝ","ｵｷｸﾞﾝﾁﾌﾞﾑﾗ"]
[null,null,"島根県","隠岐郡隠岐の島町","ｼﾏﾈｹﾝ","ｵｷｸﾞﾝｵｷﾉｼﾏﾁｮｳ"]
[null,null,"岡山県","岡山市北区","ｵｶﾔﾏｹﾝ","ｵｶﾔﾏｼｷﾀｸ"]
[null,null,"岡山県","岡山市中区","ｵｶﾔﾏｹﾝ","ｵｶﾔﾏｼﾅｶｸ"]
[null,null,"岡山県","岡山市東区","ｵｶﾔﾏｹﾝ","ｵｶﾔﾏｼﾋｶﾞｼｸ"]
[null,null,"岡山県","岡山市南区","ｵｶﾔﾏｹﾝ","ｵｶﾔﾏｼﾐﾅﾐｸ"]
[null,null,"岡山県","倉敷市","ｵｶﾔﾏｹﾝ","ｸﾗｼｷｼ"]
[null,null,"岡山県","津山市","ｵｶﾔﾏｹﾝ","ﾂﾔﾏｼ"]
[null,null,"岡山県","玉野市","ｵｶﾔﾏｹﾝ","ﾀﾏﾉｼ"]
[null,null,"岡山県","笠岡市","ｵｶﾔﾏｹﾝ","ｶｻｵｶｼ"]
[null,null,"岡山県","井原市","ｵｶﾔﾏｹﾝ","ｲﾊﾞﾗｼ"]
[null,null,"岡山県","総社市","ｵｶﾔﾏｹﾝ","ｿｳｼﾞｬｼ"]
[null,null,"岡山県","高梁市","ｵｶﾔﾏｹﾝ","ﾀｶﾊｼｼ"]
[null,null,"岡山県","新見市","ｵｶﾔﾏｹﾝ","ﾆｲﾐｼ"]
[null,null,"岡山県","備前市","ｵｶﾔﾏｹﾝ","ﾋﾞｾﾞﾝｼ"]
[null,null,"岡山県","瀬戸内市","ｵｶﾔﾏｹﾝ","ｾﾄｳﾁｼ"]
[null,null,"岡山県","赤磐市","ｵｶﾔﾏｹﾝ","ｱｶｲﾜｼ"]
[null,null,"岡山県","真庭市","ｵｶﾔﾏｹﾝ","ﾏﾆﾜｼ"]
[null,null,"岡山県","美作市","ｵｶﾔﾏｹﾝ","ﾐﾏｻｶｼ"]
[null,null,"岡山県","浅口市","ｵｶﾔﾏｹﾝ","ｱｻｸﾁｼ"]
[null,null,"岡山県","和気郡和気町","ｵｶﾔﾏｹﾝ","ﾜｹｸﾞﾝﾜｹﾁｮｳ"]
[null,null,"岡山県","都窪郡早島町","ｵｶﾔﾏｹﾝ","ﾂｸﾎﾞｸﾞﾝﾊﾔｼﾏﾁｮｳ"]
[null,null,"岡山県","浅口郡里庄町","ｵｶﾔﾏｹﾝ","ｱｻｸﾁｸﾞﾝｻﾄｼｮｳﾁｮｳ"]
[null,null,"岡山県","小田郡矢掛町","ｵｶﾔﾏｹﾝ","ｵﾀﾞｸﾞﾝﾔｶｹﾞﾁｮｳ"]
[null,null,"岡山県","真庭郡新庄村","ｵｶﾔﾏｹﾝ","ﾏﾆﾜｸﾞﾝｼﾝｼﾞｮｳｿﾝ"]
[null,null,"岡山県","苫田郡鏡野町","ｵｶﾔﾏｹﾝ","ﾄﾏﾀｸﾞﾝｶｶﾞﾐﾉﾁｮｳ"]
[null,null,"岡山県","勝田郡勝央町","ｵｶﾔﾏｹﾝ","ｶﾂﾀｸﾞﾝｼｮｳｵｳﾁｮｳ"]
[null,null,"岡山県","勝田郡奈義町","ｵｶﾔﾏｹﾝ","ｶﾂﾀｸﾞﾝﾅｷﾞﾁｮｳ"]
[null,null,"岡山県","英田郡西粟倉村","ｵｶﾔﾏｹﾝ","ｱｲﾀﾞｸﾞﾝﾆｼｱﾜｸﾗｿﾝ"]
[null,null,"岡山県","久米郡久米南町","ｵｶﾔﾏｹﾝ","ｸﾒｸﾞﾝｸﾒﾅﾝﾁｮｳ"]
[null,null,"岡山県","久米郡美咲町","ｵｶﾔﾏｹﾝ","ｸﾒｸﾞﾝﾐｻｷﾁｮｳ"]
[null,null,"岡山県","加賀郡吉備中央町","ｵｶﾔﾏｹﾝ","ｶｶﾞｸﾞﾝｷﾋﾞﾁｭｳｵｳﾁｮｳ"]
[null,null,"広島県","広島市中区","ﾋﾛｼﾏｹﾝ","ﾋﾛｼﾏｼﾅｶｸ"]
[null,null,"広島県","広島市東区","ﾋﾛｼﾏｹﾝ","ﾋﾛｼﾏｼﾋｶﾞｼｸ"]
[null,null,"広島県","広島市南区","ﾋﾛｼﾏｹﾝ","ﾋﾛｼﾏｼﾐﾅﾐｸ"]
[null,null,"広島県","広島市西区","ﾋﾛｼﾏｹﾝ","ﾋﾛｼﾏｼﾆｼｸ"]
[null,null,"広島県","広島市安佐南区","ﾋﾛｼﾏｹﾝ","ﾋﾛｼﾏｼｱｻﾐﾅﾐｸ"]
[null,null,"広島県","広島市安佐北区","ﾋﾛｼﾏｹﾝ","ﾋﾛｼﾏｼｱｻｷﾀｸ"]
[null,null,"広島県","広島市安芸区","ﾋﾛｼﾏｹﾝ","ﾋﾛｼﾏｼｱｷｸ"]
[null,null,"広島県","広島市佐伯区","ﾋﾛｼﾏｹﾝ","ﾋﾛｼﾏｼｻｴｷｸ"]
[null,null,"広島県","呉市","ﾋﾛｼﾏｹﾝ","ｸﾚｼ"]
[null,null,"広島県","竹原市","ﾋﾛｼﾏｹﾝ","ﾀｹﾊﾗｼ"]
[null,null,"広島県","三原市","ﾋﾛｼﾏｹﾝ","ﾐﾊﾗｼ"]
[null,null,"広島県","尾道市","ﾋﾛｼﾏｹﾝ","ｵﾉﾐﾁｼ"]
[null,null,"広島県","福山市","ﾋﾛｼﾏｹﾝ","ﾌｸﾔﾏｼ"]
[null,null,"広島県","府中市","ﾋﾛｼﾏｹﾝ","ﾌﾁｭｳｼ"]
[null,null,"広島県","三次市","ﾋﾛｼﾏｹﾝ","ﾐﾖｼｼ"]
[null,null,"広島県","庄原市","ﾋﾛｼﾏｹﾝ","ｼｮｳﾊﾞﾗｼ"]
[null,null,"広島県","大竹市","ﾋﾛｼﾏｹﾝ","ｵｵﾀｹｼ"]
[null,null,"広島県","東広島市","ﾋﾛｼﾏｹﾝ","ﾋｶﾞｼﾋﾛｼﾏｼ"]
[null,null,"広島県","廿日市市","ﾋﾛｼﾏｹﾝ","ﾊﾂｶｲﾁｼ"]
[null,null,"広島県","安芸高田市","ﾋﾛｼﾏｹﾝ","ｱｷﾀｶﾀｼ"]
[null,null,"広島県","江田島市","ﾋﾛｼﾏｹﾝ","ｴﾀｼﾞﾏｼ"]
[null,null,"広島県","安芸郡府中町","ﾋﾛｼﾏｹﾝ","ｱｷｸﾞﾝﾌﾁｭｳﾁｮｳ"]
[null,null,"広島県","安芸郡海田町","ﾋﾛｼﾏｹﾝ","ｱｷｸﾞﾝｶｲﾀﾁｮｳ"]
[null,null,"広島県","安芸郡熊野町","ﾋﾛｼﾏｹﾝ","ｱｷｸﾞﾝｸﾏﾉﾁｮｳ"]
[null,null,"広島県","安芸郡坂町","ﾋﾛｼﾏｹﾝ","ｱｷｸﾞﾝｻｶﾁｮｳ"]
[null,null,"広島県","山県郡安芸太田町","ﾋﾛｼﾏｹﾝ","ﾔﾏｶﾞﾀｸﾞﾝｱｷｵｵﾀﾁｮｳ"]
[null,null,"広島県","山県郡北広島町","ﾋﾛｼﾏｹﾝ","ﾔﾏｶﾞﾀｸﾞﾝｷﾀﾋﾛｼﾏﾁｮｳ"]
[null,null,"広島県","豊田郡大崎上島町","ﾋﾛｼﾏｹﾝ","ﾄﾖﾀｸﾞﾝｵｵｻｷｶﾐｼﾞﾏﾁｮｳ"]
[null,null,"広島県","世羅郡世羅町","ﾋﾛｼﾏｹﾝ","ｾﾗｸﾞﾝｾﾗﾁｮｳ"]
[null,null,"広島県","神石郡神石高原町","ﾋﾛｼﾏｹﾝ","ｼﾞﾝｾｷｸﾞﾝｼﾞﾝｾｷｺｳｹﾞﾝﾁｮｳ"]
[null,null,"山口県","下関市","ﾔﾏｸﾞﾁｹﾝ","ｼﾓﾉｾｷｼ"]
[null,null,"山口県","宇部市","ﾔﾏｸﾞﾁｹﾝ","ｳﾍﾞｼ"]
[null,null,"山口県","山口市","ﾔﾏｸﾞﾁｹﾝ","ﾔﾏｸﾞﾁｼ"]
[null,null,"山口県","萩市","ﾔﾏｸﾞﾁｹﾝ","ﾊｷﾞｼ"]
[null,null,"山口県","防府市","ﾔﾏｸﾞﾁｹﾝ","ﾎｳﾌｼ"]
[null,null,"山口県","下松市","ﾔﾏｸﾞﾁｹﾝ","ｸﾀﾞﾏﾂｼ"]
[null,null,"山口県","岩国市","ﾔﾏｸﾞﾁｹﾝ","ｲﾜｸﾆｼ"]
[null,null,"山口県","光市","ﾔﾏｸﾞﾁｹﾝ","ﾋｶﾘｼ"]
[null,null,"山口県","長門市","ﾔﾏｸﾞﾁｹﾝ","ﾅｶﾞﾄｼ"]
[null,null,"山口県","柳井市","ﾔﾏｸﾞﾁｹﾝ","ﾔﾅｲｼ"]
[null,null,"山口県","美祢市","ﾔﾏｸﾞﾁｹﾝ","ﾐﾈｼ"]
[null,null,"山口県","周南市","ﾔﾏｸﾞﾁｹﾝ","ｼｭｳﾅﾝｼ"]
[null,null,"山口県","山陽小野田市","ﾔﾏｸﾞﾁｹﾝ","ｻﾝﾖｳｵﾉﾀﾞｼ"]
[null,null,"山口県","大島郡周防大島町","ﾔﾏｸﾞﾁｹﾝ","ｵｵｼﾏｸﾞﾝｽｵｳｵｵｼﾏﾁｮｳ"]
[null,null,"山口県","玖珂郡和木町","ﾔﾏｸﾞﾁｹﾝ","ｸｶﾞｸﾞﾝﾜｷﾁｮｳ"]
[null,null,"山口県","熊毛郡上関町","ﾔﾏｸﾞﾁｹﾝ","ｸﾏｹﾞｸﾞﾝｶﾐﾉｾｷﾁｮｳ"]
[null,null,"山口県","熊毛郡田布施町","ﾔﾏｸﾞﾁｹﾝ","ｸﾏｹﾞｸﾞﾝﾀﾌﾞｾﾁｮｳ"]
[null,null,"山口県","熊毛郡平生町","ﾔﾏｸﾞﾁｹﾝ","ｸﾏｹﾞｸﾞﾝﾋﾗｵﾁｮｳ"]
[null,null,"山口県","阿武郡阿武町","ﾔﾏｸﾞﾁｹﾝ","ｱﾌﾞｸﾞﾝｱﾌﾞﾁｮｳ"]
[null,null,"徳島県","徳島市","ﾄｸｼﾏｹﾝ","ﾄｸｼﾏｼ"]
[null,null,"徳島県","鳴門市","ﾄｸｼﾏｹﾝ","ﾅﾙﾄｼ"]
[null,null,"徳島県","小松島市","ﾄｸｼﾏｹﾝ","ｺﾏﾂｼﾏｼ"]
[null,null,"徳島県","阿南市","ﾄｸｼﾏｹﾝ","ｱﾅﾝｼ"]
[null,null,"徳島県","吉野川市","ﾄｸｼﾏｹﾝ","ﾖｼﾉｶﾞﾜｼ"]
[null,null,"徳島県","阿波市","ﾄｸｼﾏｹﾝ","ｱﾜｼ"]
[null,null,"徳島県","美馬市","ﾄｸｼﾏｹﾝ","ﾐﾏｼ"]
[null,null,"徳島県","三好市","ﾄｸｼﾏｹﾝ","ﾐﾖｼｼ"]
[null,null,"徳島県","勝浦郡勝浦町","ﾄｸｼﾏｹﾝ","ｶﾂｳﾗｸﾞﾝｶﾂｳﾗﾁｮｳ"]
[null,null,"徳島県","勝浦郡上勝町","ﾄｸｼﾏｹﾝ","ｶﾂｳﾗｸﾞﾝｶﾐｶﾂﾁｮｳ"]
[null,null,"徳島県","名東郡佐那河内村","ﾄｸｼﾏｹﾝ","ﾐｮｳﾄﾞｳｸﾞﾝｻﾅｺﾞｳﾁｿﾝ"]
[null,null,"徳島県","名西郡石井町","ﾄｸｼﾏｹﾝ","ﾐｮｳｻﾞｲｸﾞﾝｲｼｲﾁｮｳ"]
[null,null,"徳島県","名西郡神山町","ﾄｸｼﾏｹﾝ","ﾐｮｳｻﾞｲｸﾞﾝｶﾐﾔﾏﾁｮｳ"]
[null,null,"徳島県","那賀郡那賀町","ﾄｸｼﾏｹﾝ","ﾅｶｸﾞﾝﾅｶﾁｮｳ"]
[null,null,"徳島県","海部郡牟岐町","ﾄｸｼﾏｹﾝ","ｶｲﾌｸﾞﾝﾑｷﾞﾁｮｳ"]
[null,null,"徳島県","海部郡美波町","ﾄｸｼﾏｹﾝ","ｶｲﾌｸﾞﾝﾐﾅﾐﾁｮｳ"]
[null,null,"徳島県","海部郡海陽町","ﾄｸｼﾏｹﾝ","ｶｲﾌｸﾞﾝｶｲﾖｳﾁｮｳ"]
[null,null,"徳島県","板野郡松茂町","ﾄｸｼﾏｹﾝ","ｲﾀﾉｸﾞﾝﾏﾂｼｹﾞﾁｮｳ"]
[null,null,"徳島県","板野郡北島町","ﾄｸｼﾏｹﾝ","ｲﾀﾉｸﾞﾝｷﾀｼﾞﾏﾁｮｳ"]
[null,null,"徳島県","板野郡藍住町","ﾄｸｼﾏｹﾝ","ｲﾀﾉｸﾞﾝｱｲｽﾞﾐﾁｮｳ"]
[null,null,"徳島県","板野郡板野町","ﾄｸｼﾏｹﾝ","ｲﾀﾉｸﾞﾝｲﾀﾉﾁｮｳ"]
[null,null,"徳島県","板野郡上板町","ﾄｸｼﾏｹﾝ","ｲﾀﾉｸﾞﾝｶﾐｲﾀﾁｮｳ"]
[null,null,"徳島県","美馬郡つるぎ町","ﾄｸｼﾏｹﾝ","ﾐﾏｸﾞﾝﾂﾙｷﾞﾁｮｳ"]
[null,null,"徳島県","三好郡東みよし町","ﾄｸｼﾏｹﾝ","ﾐﾖｼｸﾞﾝﾋｶﾞｼﾐﾖｼﾁｮｳ"]
[null,null,"香川県","高松市","ｶｶﾞﾜｹﾝ","ﾀｶﾏﾂｼ"]
[null,null,"香川県","丸亀市","ｶｶﾞﾜｹﾝ","ﾏﾙｶﾞﾒｼ"]
[null,null,"香川県","坂出市","ｶｶﾞﾜｹﾝ","ｻｶｲﾃﾞｼ"]
[null,null,"香川県","善通寺市","ｶｶﾞﾜｹﾝ","ｾﾞﾝﾂｳｼﾞｼ"]
[null,null,"香川県","観音寺市","ｶｶﾞﾜｹﾝ","ｶﾝｵﾝｼﾞｼ"]
[null,null,"香川県","さぬき市","ｶｶﾞﾜｹﾝ","ｻﾇｷｼ"]
[null,null,"香川県","東かがわ市","ｶｶﾞﾜｹﾝ","ﾋｶﾞｼｶｶﾞﾜｼ"]
[null,null,"香川県","三豊市","ｶｶﾞﾜｹﾝ","ﾐﾄﾖｼ"]
[null,null,"香川県","小豆郡土庄町","ｶｶﾞﾜｹﾝ","ｼｮｳｽﾞｸﾞﾝﾄﾉｼｮｳﾁｮｳ"]
[null,null,"香川県","小豆郡小豆島町","ｶｶﾞﾜｹﾝ","ｼｮｳｽﾞｸﾞﾝｼｮｳﾄﾞｼﾏﾁｮｳ"]
[null,null,"香川県","木田郡三木町","ｶｶﾞﾜｹﾝ","ｷﾀｸﾞﾝﾐｷﾁｮｳ"]
[null,null,"香川県","香川郡直島町","ｶｶﾞﾜｹﾝ","ｶｶﾞﾜｸﾞﾝﾅｵｼﾏﾁｮｳ"]
[null,null,"香川県","綾歌郡宇多津町","ｶｶﾞﾜｹﾝ","ｱﾔｳﾀｸﾞﾝｳﾀﾂﾞﾁｮｳ"]
[null,null,"香川県","綾歌郡綾川町","ｶｶﾞﾜｹﾝ","ｱﾔｳﾀｸﾞﾝｱﾔｶﾞﾜﾁｮｳ"]
[null,null,"香川県","仲多度郡琴平町","ｶｶﾞﾜｹﾝ","ﾅｶﾀﾄﾞｸﾞﾝｺﾄﾋﾗﾁｮｳ"]
[null,null,"香川県","仲多度郡多度津町","ｶｶﾞﾜｹﾝ","ﾅｶﾀﾄﾞｸﾞﾝﾀﾄﾞﾂﾁｮｳ"]
[null,null,"香川県","仲多度郡まんのう町","ｶｶﾞﾜｹﾝ","ﾅｶﾀﾄﾞｸﾞﾝﾏﾝﾉｳﾁｮｳ"]
[null,null,"愛媛県","松山市","ｴﾋﾒｹﾝ","ﾏﾂﾔﾏｼ"]
[null,null,"愛媛県","今治市","ｴﾋﾒｹﾝ","ｲﾏﾊﾞﾘｼ"]
[null,null,"愛媛県","宇和島市","ｴﾋﾒｹﾝ","ｳﾜｼﾞﾏｼ"]
[null,null,"愛媛県","八幡浜市","ｴﾋﾒｹﾝ","ﾔﾜﾀﾊﾏｼ"]
[null,null,"愛媛県","新居浜市","ｴﾋﾒｹﾝ","ﾆｲﾊﾏｼ"]
[null,null,"愛媛県","西条市","ｴﾋﾒｹﾝ","ｻｲｼﾞｮｳｼ"]
[null,null,"愛媛県","大洲市","ｴﾋﾒｹﾝ","ｵｵｽﾞｼ"]
[null,null,"愛媛県","伊予市","ｴﾋﾒｹﾝ","ｲﾖｼ"]
[null,null,"愛媛県","四国中央市","ｴﾋﾒｹﾝ","ｼｺｸﾁｭｳｵｳｼ"]
[null,null,"愛媛県","西予市","ｴﾋﾒｹﾝ","ｾｲﾖｼ"]
[null,null,"愛媛県","東温市","ｴﾋﾒｹﾝ","ﾄｳｵﾝｼ"]
[null,null,"愛媛県","越智郡上島町","ｴﾋﾒｹﾝ","ｵﾁｸﾞﾝｶﾐｼﾞﾏﾁｮｳ"]
[null,null,"愛媛県","上浮穴郡久万高原町","ｴﾋﾒｹﾝ","ｶﾐｳｹﾅｸﾞﾝｸﾏｺｳｹﾞﾝﾁｮｳ"]
[null,null,"愛媛県","伊予郡松前町","ｴﾋﾒｹﾝ","ｲﾖｸﾞﾝﾏｻｷﾁｮｳ"]
[null,null,"愛媛県","伊予郡砥部町","ｴﾋﾒｹﾝ","ｲﾖｸﾞﾝﾄﾍﾞﾁｮｳ"]
[null,null,"愛媛県","喜多郡内子町","ｴﾋﾒｹﾝ","ｷﾀｸﾞﾝｳﾁｺﾁｮｳ"]
[null,null,"愛媛県","西宇和郡伊方町","ｴﾋﾒｹﾝ","ﾆｼｳﾜｸﾞﾝｲｶﾀﾁｮｳ"]
[null,null,"愛媛県","北宇和郡松野町","ｴﾋﾒｹﾝ","ｷﾀｳﾜｸﾞﾝﾏﾂﾉﾁｮｳ"]
[null,null,"愛媛県","北宇和郡鬼北町","ｴﾋﾒｹﾝ","ｷﾀｳﾜｸﾞﾝｷﾎｸﾁｮｳ"]
[null,null,"愛媛県","南宇和郡愛南町","ｴﾋﾒｹﾝ","ﾐﾅﾐｳﾜｸﾞﾝｱｲﾅﾝﾁｮｳ"]
[null,null,"高知県","高知市","ｺｳﾁｹﾝ","ｺｳﾁｼ"]
[null,null,"高知県","室戸市","ｺｳﾁｹﾝ","ﾑﾛﾄｼ"]
[null,null,"高知県","安芸市","ｺｳﾁｹﾝ","ｱｷｼ"]
[null,null,"高知県","南国市","ｺｳﾁｹﾝ","ﾅﾝｺｸｼ"]
[null,null,"高知県","土佐市","ｺｳﾁｹﾝ","ﾄｻｼ"]
[null,null,"高知県","須崎市","ｺｳﾁｹﾝ","ｽｻｷｼ"]
[null,null,"高知県","宿毛市","ｺｳﾁｹﾝ","ｽｸﾓｼ"]
[null,null,"高知県","土佐清水市","ｺｳﾁｹﾝ","ﾄｻｼﾐｽﾞｼ"]
[null,null,"高知県","四万十市","ｺｳﾁｹﾝ","ｼﾏﾝﾄｼ"]
[null,null,"高知県","香南市","ｺｳﾁｹﾝ","ｺｳﾅﾝｼ"]
[null,null,"高知県","香美市","ｺｳﾁｹﾝ","ｶﾐｼ"]
[null,null,"高知県","安芸郡東洋町","ｺｳﾁｹﾝ","ｱｷｸﾞﾝﾄｳﾖｳﾁｮｳ"]
[null,null,"高知県","安芸郡奈半利町","ｺｳﾁｹﾝ","ｱｷｸﾞﾝﾅﾊﾘﾁｮｳ"]
[null,null,"高知県","安芸郡田野町","ｺｳﾁｹﾝ","ｱｷｸﾞﾝﾀﾉﾁｮｳ"]
[null,null,"高知県","安芸郡安田町","ｺｳﾁｹﾝ","ｱｷｸﾞﾝﾔｽﾀﾞﾁｮｳ"]
[null,null,"高知県","安芸郡北川村","ｺｳﾁｹﾝ","ｱｷｸﾞﾝｷﾀｶﾞﾜﾑﾗ"]
[null,null,"高知県","安芸郡馬路村","ｺｳﾁｹﾝ","ｱｷｸﾞﾝｳﾏｼﾞﾑﾗ"]
[null,null,"高知県","安芸郡芸西村","ｺｳﾁｹﾝ","ｱｷｸﾞﾝｹﾞｲｾｲﾑﾗ"]
[null,null,"高知県","長岡郡本山町","ｺｳﾁｹﾝ","ﾅｶﾞｵｶｸﾞﾝﾓﾄﾔﾏﾁｮｳ"]
[null,null,"高知県","長岡郡大豊町","ｺｳﾁｹﾝ","ﾅｶﾞｵｶｸﾞﾝｵｵﾄﾖﾁｮｳ"]
[null,null,"高知県","土佐郡土佐町","ｺｳﾁｹﾝ","ﾄｻｸﾞﾝﾄｻﾁｮｳ"]
[null,null,"高知県","土佐郡大川村","ｺｳﾁｹﾝ","ﾄｻｸﾞﾝｵｵｶﾜﾑﾗ"]
[null,null,"高知県","吾川郡いの町","ｺｳﾁｹﾝ","ｱｶﾞﾜｸﾞﾝｲﾉﾁｮｳ"]
[null,null,"高知県","吾川郡仁淀川町","ｺｳﾁｹﾝ","ｱｶﾞﾜｸﾞﾝﾆﾖﾄﾞｶﾞﾜﾁｮｳ"]
[null,null,"高知県","高岡郡中土佐町","ｺｳﾁｹﾝ","ﾀｶｵｶｸﾞﾝﾅｶﾄｻﾁｮｳ"]
[null,null,"高知県","高岡郡佐川町","ｺｳﾁｹﾝ","ﾀｶｵｶｸﾞﾝｻｶﾜﾁｮｳ"]
[null,null,"高知県","高岡郡越知町","ｺｳﾁｹﾝ","ﾀｶｵｶｸﾞﾝｵﾁﾁｮｳ"]
[null,null,"高知県","高岡郡檮原町","ｺｳﾁｹﾝ","ﾀｶｵｶｸﾞﾝﾕｽﾊﾗﾁｮｳ"]
[null,null,"高知県","高岡郡日高村","ｺｳﾁｹﾝ","ﾀｶｵｶｸﾞﾝﾋﾀﾞｶﾑﾗ"]
[null,null,"高知県","高岡郡津野町","ｺｳﾁｹﾝ","ﾀｶｵｶｸﾞﾝﾂﾉﾁｮｳ"]
[null,null,"高知県","高岡郡四万十町","ｺｳﾁｹﾝ","ﾀｶｵｶｸﾞﾝｼﾏﾝﾄﾁｮｳ"]
[null,null,"高知県","幡多郡大月町","ｺｳﾁｹﾝ","ﾊﾀｸﾞﾝｵｵﾂｷﾁｮｳ"]
[null,null,"高知県","幡多郡三原村","ｺｳﾁｹﾝ","ﾊﾀｸﾞﾝﾐﾊﾗﾑﾗ"]
[null,null,"高知県","幡多郡黒潮町","ｺｳﾁｹﾝ","ﾊﾀｸﾞﾝｸﾛｼｵﾁｮｳ"]
[null,null,"福岡県","北九州市門司区","ﾌｸｵｶｹﾝ","ｷﾀｷｭｳｼｭｳｼﾓｼﾞｸ"]
[null,null,"福岡県","北九州市若松区","ﾌｸｵｶｹﾝ","ｷﾀｷｭｳｼｭｳｼﾜｶﾏﾂｸ"]
[null,null,"福岡県","北九州市戸畑区","ﾌｸｵｶｹﾝ","ｷﾀｷｭｳｼｭｳｼﾄﾊﾞﾀｸ"]
[null,null,"福岡県","北九州市小倉北区","ﾌｸｵｶｹﾝ","ｷﾀｷｭｳｼｭｳｼｺｸﾗｷﾀｸ"]
[null,null,"福岡県","北九州市小倉南区","ﾌｸｵｶｹﾝ","ｷﾀｷｭｳｼｭｳｼｺｸﾗﾐﾅﾐｸ"]
[null,null,"福岡県","北九州市八幡東区","ﾌｸｵｶｹﾝ","ｷﾀｷｭｳｼｭｳｼﾔﾊﾀﾋｶﾞｼｸ"]
[null,null,"福岡県","北九州市八幡西区","ﾌｸｵｶｹﾝ","ｷﾀｷｭｳｼｭｳｼﾔﾊﾀﾆｼｸ"]
[null,null,"福岡県","福岡市東区","ﾌｸｵｶｹﾝ","ﾌｸｵｶｼﾋｶﾞｼｸ"]
[null,null,"福岡県","福岡市博多区","ﾌｸｵｶｹﾝ","ﾌｸｵｶｼﾊｶﾀｸ"]
[null,null,"福岡県","福岡市中央区","ﾌｸｵｶｹﾝ","ﾌｸｵｶｼﾁｭｳｵｳｸ"]
[null,null,"福岡県","福岡市南区","ﾌｸｵｶｹﾝ","ﾌｸｵｶｼﾐﾅﾐｸ"]
[null,null,"福岡県","福岡市西区","ﾌｸｵｶｹﾝ","ﾌｸｵｶｼﾆｼｸ"]
[null,null,"福岡県","福岡市城南区","ﾌｸｵｶｹﾝ","ﾌｸｵｶｼｼﾞｮｳﾅﾝｸ"]
[null,null,"福岡県","福岡市早良区","ﾌｸｵｶｹﾝ","ﾌｸｵｶｼｻﾜﾗｸ"]
[null,null,"福岡県","大牟田市","ﾌｸｵｶｹﾝ","ｵｵﾑﾀｼ"]
[null,null,"福岡県","久留米市","ﾌｸｵｶｹﾝ","ｸﾙﾒｼ"]
[null,null,"福岡県","直方市","ﾌｸｵｶｹﾝ","ﾉｵｶﾞﾀｼ"]
[null,null,"福岡県","飯塚市","ﾌｸｵｶｹﾝ","ｲｲﾂﾞｶｼ"]
[null,null,"福岡県","田川市","ﾌｸｵｶｹﾝ","ﾀｶﾞﾜｼ"]
[null,null,"福岡県","柳川市","ﾌｸｵｶｹﾝ","ﾔﾅｶﾞﾜｼ"]
[null,null,"福岡県","八女市","ﾌｸｵｶｹﾝ","ﾔﾒｼ"]
[null,null,"福岡県","筑後市","ﾌｸｵｶｹﾝ","ﾁｸｺﾞｼ"]
[null,null,"福岡県","大川市","ﾌｸｵｶｹﾝ","ｵｵｶﾜｼ"]
[null,null,"福岡県","行橋市","ﾌｸｵｶｹﾝ","ﾕｸﾊｼｼ"]
[null,null,"福岡県","豊前市","ﾌｸｵｶｹﾝ","ﾌﾞｾﾞﾝｼ"]
[null,null,"福岡県","中間市","ﾌｸｵｶｹﾝ","ﾅｶﾏｼ"]
[null,null,"福岡県","小郡市","ﾌｸｵｶｹﾝ","ｵｺﾞｵﾘｼ"]
[null,null,"福岡県","筑紫野市","ﾌｸｵｶｹﾝ","ﾁｸｼﾉｼ"]
[null,null,"福岡県","春日市","ﾌｸｵｶｹﾝ","ｶｽｶﾞｼ"]
[null,null,"福岡県","大野城市","ﾌｸｵｶｹﾝ","ｵｵﾉｼﾞｮｳｼ"]
[null,null,"福岡県","宗像市","ﾌｸｵｶｹﾝ","ﾑﾅｶﾀｼ"]
[null,null,"福岡県","太宰府市","ﾌｸｵｶｹﾝ","ﾀﾞｻﾞｲﾌｼ"]
[null,null,"福岡県","古賀市","ﾌｸｵｶｹﾝ","ｺｶﾞｼ"]
[null,null,"福岡県","福津市","ﾌｸｵｶｹﾝ","ﾌｸﾂｼ"]
[null,null,"福岡県","うきは市","ﾌｸｵｶｹﾝ","ｳｷﾊｼ"]
[null,null,"福岡県","宮若市","ﾌｸｵｶｹﾝ","ﾐﾔﾜｶｼ"]
[null,null,"福岡県","嘉麻市","ﾌｸｵｶｹﾝ","ｶﾏｼ"]
[null,null,"福岡県","朝倉市","ﾌｸｵｶｹﾝ","ｱｻｸﾗｼ"]
[null,null,"福岡県","みやま市","ﾌｸｵｶｹﾝ","ﾐﾔﾏｼ"]
[null,null,"福岡県","糸島市","ﾌｸｵｶｹﾝ","ｲﾄｼﾏｼ"]
[null,null,"福岡県","那珂川市","ﾌｸｵｶｹﾝ","ﾅｶｶﾞﾜｼ"]
[null,null,"福岡県","糟屋郡宇美町","ﾌｸｵｶｹﾝ","ｶｽﾔｸﾞﾝｳﾐﾏﾁ"]
[null,null,"福岡県","糟屋郡篠栗町","ﾌｸｵｶｹﾝ","ｶｽﾔｸﾞﾝｻｻｸﾞﾘﾏﾁ"]
[null,null,"福岡県","糟屋郡志免町","ﾌｸｵｶｹﾝ","ｶｽﾔｸﾞﾝｼﾒﾏﾁ"]
[null,null,"福岡県","糟屋郡須惠町","ﾌｸｵｶｹﾝ","ｶｽﾔｸﾞﾝｽｴﾏﾁ"]
[null,null,"福岡県","糟屋郡新宮町","ﾌｸｵｶｹﾝ","ｶｽﾔｸﾞﾝｼﾝｸﾞｳﾏﾁ"]
[null,null,"福岡県","糟屋郡久山町","ﾌｸｵｶｹﾝ","ｶｽﾔｸﾞﾝﾋｻﾔﾏﾏﾁ"]
[null,null,"福岡県","糟屋郡粕屋町","ﾌｸｵｶｹﾝ","ｶｽﾔｸﾞﾝｶｽﾔﾏﾁ"]
[null,null,"福岡県","遠賀郡芦屋町","ﾌｸｵｶｹﾝ","ｵﾝｶﾞｸﾞﾝｱｼﾔﾏﾁ"]
[null,null,"福岡県","遠賀郡水巻町","ﾌｸｵｶｹﾝ","ｵﾝｶﾞｸﾞﾝﾐｽﾞﾏｷﾏﾁ"]
[null,null,"福岡県","遠賀郡岡垣町","ﾌｸｵｶｹﾝ","ｵﾝｶﾞｸﾞﾝｵｶｶﾞｷﾏﾁ"]
[null,null,"福岡県","遠賀郡遠賀町","ﾌｸｵｶｹﾝ","ｵﾝｶﾞｸﾞﾝｵﾝｶﾞﾁｮｳ"]
[null,null,"福岡県","鞍手郡小竹町","ﾌｸｵｶｹﾝ","ｸﾗﾃｸﾞﾝｺﾀｹﾏﾁ"]
[null,null,"福岡県","鞍手郡鞍手町","ﾌｸｵｶｹﾝ","ｸﾗﾃｸﾞﾝｸﾗﾃﾏﾁ"]
[null,null,"福岡県","嘉穂郡桂川町","ﾌｸｵｶｹﾝ","ｶﾎｸﾞﾝｹｲｾﾝﾏﾁ"]
[null,null,"福岡県","朝倉郡筑前町","ﾌｸｵｶｹﾝ","ｱｻｸﾗｸﾞﾝﾁｸｾﾞﾝﾏﾁ"]
[null,null,"福岡県","朝倉郡東峰村","ﾌｸｵｶｹﾝ","ｱｻｸﾗｸﾞﾝﾄｳﾎｳﾑﾗ"]
[null,null,"福岡県","三井郡大刀洗町","ﾌｸｵｶｹﾝ","ﾐｲｸﾞﾝﾀﾁｱﾗｲﾏﾁ"]
[null,null,"福岡県","三潴郡大木町","ﾌｸｵｶｹﾝ","ﾐｽﾞﾏｸﾞﾝｵｵｷﾏﾁ"]
[null,null,"福岡県","八女郡広川町","ﾌｸｵｶｹﾝ","ﾔﾒｸﾞﾝﾋﾛｶﾜﾏﾁ"]
[null,null,"福岡県","田川郡香春町","ﾌｸｵｶｹﾝ","ﾀｶﾞﾜｸﾞﾝｶﾜﾗﾏﾁ"]
[null,null,"福岡県","田川郡添田町","ﾌｸｵｶｹﾝ","ﾀｶﾞﾜｸﾞﾝｿｴﾀﾞﾏﾁ"]
[null,null,"福岡県","田川郡糸田町","ﾌｸｵｶｹﾝ","ﾀｶﾞﾜｸﾞﾝｲﾄﾀﾞﾏﾁ"]
[null,null,"福岡県","田川郡川崎町","ﾌｸｵｶｹﾝ","ﾀｶﾞﾜｸﾞﾝｶﾜｻｷﾏﾁ"]
[null,null,"福岡県","田川郡大任町","ﾌｸｵｶｹﾝ","ﾀｶﾞﾜｸﾞﾝｵｵﾄｳﾏﾁ"]
[null,null,"福岡県","田川郡赤村","ﾌｸｵｶｹﾝ","ﾀｶﾞﾜｸﾞﾝｱｶﾑﾗ"]
[null,null,"福岡県","田川郡福智町","ﾌｸｵｶｹﾝ","ﾀｶﾞﾜｸﾞﾝﾌｸﾁﾏﾁ"]
[null,null,"福岡県","京都郡苅田町","ﾌｸｵｶｹﾝ","ﾐﾔｺｸﾞﾝｶﾝﾀﾞﾏﾁ"]
[null,null,"福岡県","京都郡みやこ町","ﾌｸｵｶｹﾝ","ﾐﾔｺｸﾞﾝﾐﾔｺﾏﾁ"]
[null,null,"福岡県","築上郡吉富町","ﾌｸｵｶｹﾝ","ﾁｸｼﾞｮｳｸﾞﾝﾖｼﾄﾐﾏﾁ"]
[null,null,"福岡県","築上郡上毛町","ﾌｸｵｶｹﾝ","ﾁｸｼﾞｮｳｸﾞﾝｺｳｹﾞﾏﾁ"]
[null,null,"福岡県","築上郡築上町","ﾌｸｵｶｹﾝ","ﾁｸｼﾞｮｳｸﾞﾝﾁｸｼﾞｮｳﾏﾁ"]
[null,null,"佐賀県","佐賀市","ｻｶﾞｹﾝ","ｻｶﾞｼ"]
[null,null,"佐賀県","唐津市","ｻｶﾞｹﾝ","ｶﾗﾂｼ"]
[null,null,"佐賀県","鳥栖市","ｻｶﾞｹﾝ","ﾄｽｼ"]
[null,null,"佐賀県","多久市","ｻｶﾞｹﾝ","ﾀｸｼ"]
[null,null,"佐賀県","伊万里市","ｻｶﾞｹﾝ","ｲﾏﾘｼ"]
[null,null,"佐賀県","武雄市","ｻｶﾞｹﾝ","ﾀｹｵｼ"]
[null,null,"佐賀県","鹿島市","ｻｶﾞｹﾝ","ｶｼﾏｼ"]
[null,null,"佐賀県","小城市","ｻｶﾞｹﾝ","ｵｷﾞｼ"]
[null,null,"佐賀県","嬉野市","ｻｶﾞｹﾝ","ｳﾚｼﾉｼ"]
[null,null,"佐賀県","神埼市","ｻｶﾞｹﾝ","ｶﾝｻﾞｷｼ"]
[null,null,"佐賀県","神埼郡吉野ヶ里町","ｻｶﾞｹﾝ","ｶﾝｻﾞｷｸﾞﾝﾖｼﾉｶﾞﾘﾁｮｳ"]
[null,null,"佐賀県","三養基郡基山町","ｻｶﾞｹﾝ","ﾐﾔｷｸﾞﾝｷﾔﾏﾁｮｳ"]
[null,null,"佐賀県","三養基郡上峰町","ｻｶﾞｹﾝ","ﾐﾔｷｸﾞﾝｶﾐﾐﾈﾁｮｳ"]
[null,null,"佐賀県","三養基郡みやき町","ｻｶﾞｹﾝ","ﾐﾔｷｸﾞﾝﾐﾔｷﾁｮｳ"]
[null,null,"佐賀県","東松浦郡玄海町","ｻｶﾞｹﾝ","ﾋｶﾞｼﾏﾂｳﾗｸﾞﾝｹﾞﾝｶｲﾁｮｳ"]
[null,null,"佐賀県","西松浦郡有田町","ｻｶﾞｹﾝ","ﾆｼﾏﾂｳﾗｸﾞﾝｱﾘﾀﾁｮｳ"]
[null,null,"佐賀県","杵島郡大町町","ｻｶﾞｹﾝ","ｷｼﾏｸﾞﾝｵｵﾏﾁﾁｮｳ"]
[null,null,"佐賀県","杵島郡江北町","ｻｶﾞｹﾝ","ｷｼﾏｸﾞﾝｺｳﾎｸﾏﾁ"]
[null,null,"佐賀県","杵島郡白石町","ｻｶﾞｹﾝ","ｷｼﾏｸﾞﾝｼﾛｲｼﾁｮｳ"]
[null,null,"佐賀県","藤津郡太良町","ｻｶﾞｹﾝ","ﾌｼﾞﾂｸﾞﾝﾀﾗﾁｮｳ"]
[null,null,"長崎県","長崎市","ﾅｶﾞｻｷｹﾝ","ﾅｶﾞｻｷｼ"]
[null,null,"長崎県","佐世保市","ﾅｶﾞｻｷｹﾝ","ｻｾﾎﾞｼ"]
[null,null,"長崎県","島原市","ﾅｶﾞｻｷｹﾝ","ｼﾏﾊﾞﾗｼ"]
[null,null,"長崎県","諫早市","ﾅｶﾞｻｷｹﾝ","ｲｻﾊﾔｼ"]
[null,null,"長崎県","大村市","ﾅｶﾞｻｷｹﾝ","ｵｵﾑﾗｼ"]
[null,null,"長崎県","平戸市","ﾅｶﾞｻｷｹﾝ","ﾋﾗﾄﾞｼ"]
[null,null,"長崎県","松浦市","ﾅｶﾞｻｷｹﾝ","ﾏﾂｳﾗｼ"]
[null,null,"長崎県","対馬市","ﾅｶﾞｻｷｹﾝ","ﾂｼﾏｼ"]
[null,null,"長崎県","壱岐市","ﾅｶﾞｻｷｹﾝ","ｲｷｼ"]
[null,null,"長崎県","五島市","ﾅｶﾞｻｷｹﾝ","ｺﾞﾄｳｼ"]
[null,null,"長崎県","西海市","ﾅｶﾞｻｷｹﾝ","ｻｲｶｲｼ"]
[null,null,"長崎県","雲仙市","ﾅｶﾞｻｷｹﾝ","ｳﾝｾﾞﾝｼ"]
[null,null,"長崎県","南島原市","ﾅｶﾞｻｷｹﾝ","ﾐﾅﾐｼﾏﾊﾞﾗｼ"]
[null,null,"長崎県","西彼杵郡長与町","ﾅｶﾞｻｷｹﾝ","ﾆｼｿﾉｷﾞｸﾞﾝﾅｶﾞﾖﾁｮｳ"]
[null,null,"長崎県","西彼杵郡時津町","ﾅｶﾞｻｷｹﾝ","ﾆｼｿﾉｷﾞｸﾞﾝﾄｷﾞﾂﾁｮｳ"]
[null,null,"長崎県","東彼杵郡東彼杵町","ﾅｶﾞｻｷｹﾝ","ﾋｶﾞｼｿﾉｷﾞｸﾞﾝﾋｶﾞｼｿﾉｷﾞﾁｮｳ"]
[null,null,"長崎県","東彼杵郡川棚町","ﾅｶﾞｻｷｹﾝ","ﾋｶﾞｼｿﾉｷﾞｸﾞﾝｶﾜﾀﾅﾁｮｳ"]
[null,null,"長崎県","東彼杵郡波佐見町","ﾅｶﾞｻｷｹﾝ","ﾋｶﾞｼｿﾉｷﾞｸﾞﾝﾊｻﾐﾁｮｳ"]
[null,null,"長崎県","北松浦郡小値賀町","ﾅｶﾞｻｷｹﾝ","ｷﾀﾏﾂｳﾗｸﾞﾝｵﾁﾞｶﾁｮｳ"]
[null,null,"長崎県","北松浦郡佐々町","ﾅｶﾞｻｷｹﾝ","ｷﾀﾏﾂｳﾗｸﾞﾝｻｻﾞﾁｮｳ"]
[null,null,"長崎県","南松浦郡新上五島町","ﾅｶﾞｻｷｹﾝ","ﾐﾅﾐﾏﾂｳﾗｸﾞﾝｼﾝｶﾐｺﾞﾄｳﾁｮｳ"]
[null,null,"熊本県","熊本市中央区","ｸﾏﾓﾄｹﾝ","ｸﾏﾓﾄｼﾁｭｳｵｳｸ"]
[null,null,"熊本県","熊本市東区","ｸﾏﾓﾄｹﾝ","ｸﾏﾓﾄｼﾋｶﾞｼｸ"]
[null,null,"熊本県","熊本市西区","ｸﾏﾓﾄｹﾝ","ｸﾏﾓﾄｼﾆｼｸ"]
[null,null,"熊本県","熊本市南区","ｸﾏﾓﾄｹﾝ","ｸﾏﾓﾄｼﾐﾅﾐｸ"]
[null,null,"熊本県","熊本市北区","ｸﾏﾓﾄｹﾝ","ｸﾏﾓﾄｼｷﾀｸ"]
[null,null,"熊本県","八代市","ｸﾏﾓﾄｹﾝ","ﾔﾂｼﾛｼ"]
[null,null,"熊本県","人吉市","ｸﾏﾓﾄｹﾝ","ﾋﾄﾖｼｼ"]
[null,null,"熊本県","荒尾市","ｸﾏﾓﾄｹﾝ","ｱﾗｵｼ"]
[null,null,"熊本県","水俣市","ｸﾏﾓﾄｹﾝ","ﾐﾅﾏﾀｼ"]
[null,null,"熊本県","玉名市","ｸﾏﾓﾄｹﾝ","ﾀﾏﾅｼ"]
[null,null,"熊本県","山鹿市","ｸﾏﾓﾄｹﾝ","ﾔﾏｶﾞｼ"]
[null,null,"熊本県","菊池市","ｸﾏﾓﾄｹﾝ","ｷｸﾁｼ"]
[null,null,"熊本県","宇土市","ｸﾏﾓﾄｹﾝ","ｳﾄｼ"]
[null,null,"熊本県","上天草市","ｸﾏﾓﾄｹﾝ","ｶﾐｱﾏｸｻｼ"]
[null,null,"熊本県","宇城市","ｸﾏﾓﾄｹﾝ","ｳｷｼ"]
[null,null,"熊本県","阿蘇市","ｸﾏﾓﾄｹﾝ","ｱｿｼ"]
[null,null,"熊本県","天草市","ｸﾏﾓﾄｹﾝ","ｱﾏｸｻｼ"]
[null,null,"熊本県","合志市","ｸﾏﾓﾄｹﾝ","ｺｳｼｼ"]
[null,null,"熊本県","下益城郡美里町","ｸﾏﾓﾄｹﾝ","ｼﾓﾏｼｷｸﾞﾝﾐｻﾄﾏﾁ"]
[null,null,"熊本県","玉名郡玉東町","ｸﾏﾓﾄｹﾝ","ﾀﾏﾅｸﾞﾝｷﾞｮｸﾄｳﾏﾁ"]
[null,null,"熊本県","玉名郡南関町","ｸﾏﾓﾄｹﾝ","ﾀﾏﾅｸﾞﾝﾅﾝｶﾝﾏﾁ"]
[null,null,"熊本県","玉名郡長洲町","ｸﾏﾓﾄｹﾝ","ﾀﾏﾅｸﾞﾝﾅｶﾞｽﾏﾁ"]
[null,null,"熊本県","玉名郡和水町","ｸﾏﾓﾄｹﾝ","ﾀﾏﾅｸﾞﾝﾅｺﾞﾐﾏﾁ"]
[null,null,"熊本県","菊池郡大津町","ｸﾏﾓﾄｹﾝ","ｷｸﾁｸﾞﾝｵｵﾂﾞﾏﾁ"]
[null,null,"熊本県","菊池郡菊陽町","ｸﾏﾓﾄｹﾝ","ｷｸﾁｸﾞﾝｷｸﾖｳﾏﾁ"]
[null,null,"熊本県","阿蘇郡南小国町","ｸﾏﾓﾄｹﾝ","ｱｿｸﾞﾝﾐﾅﾐｵｸﾞﾆﾏﾁ"]
[null,null,"熊本県","阿蘇郡小国町","ｸﾏﾓﾄｹﾝ","ｱｿｸﾞﾝｵｸﾞﾆﾏﾁ"]
[null,null,"熊本県","阿蘇郡産山村","ｸﾏﾓﾄｹﾝ","ｱｿｸﾞﾝｳﾌﾞﾔﾏﾑﾗ"]
[null,null,"熊本県","阿蘇郡高森町","ｸﾏﾓﾄｹﾝ","ｱｿｸﾞﾝﾀｶﾓﾘﾏﾁ"]
[null,null,"熊本県","阿蘇郡西原村","ｸﾏﾓﾄｹﾝ","ｱｿｸﾞﾝﾆｼﾊﾗﾑﾗ"]
[null,null,"熊本県","阿蘇郡南阿蘇村","ｸﾏﾓﾄｹﾝ","ｱｿｸﾞﾝﾐﾅﾐｱｿﾑﾗ"]
[null,null,"熊本県","上益城郡御船町","ｸﾏﾓﾄｹﾝ","ｶﾐﾏｼｷｸﾞﾝﾐﾌﾈﾏﾁ"]
[null,null,"熊本県","上益城郡嘉島町","ｸﾏﾓﾄｹﾝ","ｶﾐﾏｼｷｸﾞﾝｶｼﾏﾏﾁ"]
[null,null,"熊本県","上益城郡益城町","ｸﾏﾓﾄｹﾝ","ｶﾐﾏｼｷｸﾞﾝﾏｼｷﾏﾁ"]
[null,null,"熊本県","上益城郡甲佐町","ｸﾏﾓﾄｹﾝ","ｶﾐﾏｼｷｸﾞﾝｺｳｻﾏﾁ"]
[null,null,"熊本県","上益城郡山都町","ｸﾏﾓﾄｹﾝ","ｶﾐﾏｼｷｸﾞﾝﾔﾏﾄﾁｮｳ"]
[null,null,"熊本県","八代郡氷川町","ｸﾏﾓﾄｹﾝ","ﾔﾂｼﾛｸﾞﾝﾋｶﾜﾁｮｳ"]
[null,null,"熊本県","葦北郡芦北町","ｸﾏﾓﾄｹﾝ","ｱｼｷﾀｸﾞﾝｱｼｷﾀﾏﾁ"]
[null,null,"熊本県","葦北郡津奈木町","ｸﾏﾓﾄｹﾝ","ｱｼｷﾀｸﾞﾝﾂﾅｷﾞﾏﾁ"]
[null,null,"熊本県","球磨郡錦町","ｸﾏﾓﾄｹﾝ","ｸﾏｸﾞﾝﾆｼｷﾏﾁ"]
[null,null,"熊本県","球磨郡多良木町","ｸﾏﾓﾄｹﾝ","ｸﾏｸﾞﾝﾀﾗｷﾞﾏﾁ"]
[null,null,"熊本県","球磨郡湯前町","ｸﾏﾓﾄｹﾝ","ｸﾏｸﾞﾝﾕﾉﾏｴﾏﾁ"]
[null,null,"熊本県","球磨郡水上村","ｸﾏﾓﾄｹﾝ","ｸﾏｸﾞﾝﾐｽﾞｶﾐﾑﾗ"]
[null,null,"熊本県","球磨郡相良村","ｸﾏﾓﾄｹﾝ","ｸﾏｸﾞﾝｻｶﾞﾗﾑﾗ"]
[null,null,"熊本県","球磨郡五木村","ｸﾏﾓﾄｹﾝ","ｸﾏｸﾞﾝｲﾂｷﾑﾗ"]
[null,null,"熊本県","球磨郡山江村","ｸﾏﾓﾄｹﾝ","ｸﾏｸﾞﾝﾔﾏｴﾑﾗ"]
[null,null,"熊本県","球磨郡球磨村","ｸﾏﾓﾄｹﾝ","ｸﾏｸﾞﾝｸﾏﾑﾗ"]
[null,null,"熊本県","球磨郡あさぎり町","ｸﾏﾓﾄｹﾝ","ｸﾏｸﾞﾝｱｻｷﾞﾘﾁｮｳ"]
[null,null,"熊本県","天草郡苓北町","ｸﾏﾓﾄｹﾝ","ｱﾏｸｻｸﾞﾝﾚｲﾎｸﾏﾁ"]
[null,null,"大分県","大分市","ｵｵｲﾀｹﾝ","ｵｵｲﾀｼ"]
[null,null,"大分県","別府市","ｵｵｲﾀｹﾝ","ﾍﾞｯﾌﾟｼ"]
[null,null,"大分県","中津市","ｵｵｲﾀｹﾝ","ﾅｶﾂｼ"]
[null,null,"大分県","日田市","ｵｵｲﾀｹﾝ","ﾋﾀｼ"]
[null,null,"大分県","佐伯市","ｵｵｲﾀｹﾝ","ｻｲｷｼ"]
[null,null,"大分県","臼杵市","ｵｵｲﾀｹﾝ","ｳｽｷｼ"]
[null,null,"大分県","津久見市","ｵｵｲﾀｹﾝ","ﾂｸﾐｼ"]
[null,null,"大分県","竹田市","ｵｵｲﾀｹﾝ","ﾀｹﾀｼ"]
[null,null,"大分県","豊後高田市","ｵｵｲﾀｹﾝ","ﾌﾞﾝｺﾞﾀｶﾀﾞｼ"]
[null,null,"大分県","杵築市","ｵｵｲﾀｹﾝ","ｷﾂｷｼ"]
[null,null,"大分県","宇佐市","ｵｵｲﾀｹﾝ","ｳｻｼ"]
[null,null,"大分県","豊後大野市","ｵｵｲﾀｹﾝ","ﾌﾞﾝｺﾞｵｵﾉｼ"]
[null,null,"大分県","由布市","ｵｵｲﾀｹﾝ","ﾕﾌｼ"]
[null,null,"大分県","国東市","ｵｵｲﾀｹﾝ","ｸﾆｻｷｼ"]
[null,null,"大分県","東国東郡姫島村","ｵｵｲﾀｹﾝ","ﾋｶﾞｼｸﾆｻｷｸﾞﾝﾋﾒｼﾏﾑﾗ"]
[null,null,"大分県","速見郡日出町","ｵｵｲﾀｹﾝ","ﾊﾔﾐｸﾞﾝﾋｼﾞﾏﾁ"]
[null,null,"大分県","玖珠郡九重町","ｵｵｲﾀｹﾝ","ｸｽｸﾞﾝｺｺﾉｴﾏﾁ"]
[null,null,"大分県","玖珠郡玖珠町","ｵｵｲﾀｹﾝ","ｸｽｸﾞﾝｸｽﾏﾁ"]
[null,null,"宮崎県","宮崎市","ﾐﾔｻﾞｷｹﾝ","ﾐﾔｻﾞｷｼ"]
[null,null,"宮崎県","都城市","ﾐﾔｻﾞｷｹﾝ","ﾐﾔｺﾉｼﾞｮｳｼ"]
[null,null,"宮崎県","延岡市","ﾐﾔｻﾞｷｹﾝ","ﾉﾍﾞｵｶｼ"]
[null,null,"宮崎県","日南市","ﾐﾔｻﾞｷｹﾝ","ﾆﾁﾅﾝｼ"]
[null,null,"宮崎県","小林市","ﾐﾔｻﾞｷｹﾝ","ｺﾊﾞﾔｼｼ"]
[null,null,"宮崎県","日向市","ﾐﾔｻﾞｷｹﾝ","ﾋｭｳｶﾞｼ"]
[null,null,"宮崎県","串間市","ﾐﾔｻﾞｷｹﾝ","ｸｼﾏｼ"]
[null,null,"宮崎県","西都市","ﾐﾔｻﾞｷｹﾝ","ｻｲﾄｼ"]
[null,null,"宮崎県","えびの市","ﾐﾔｻﾞｷｹﾝ","ｴﾋﾞﾉｼ"]
[null,null,"宮崎県","北諸県郡三股町","ﾐﾔｻﾞｷｹﾝ","ｷﾀﾓﾛｶﾀｸﾞﾝﾐﾏﾀﾁｮｳ"]
[null,null,"宮崎県","西諸県郡高原町","ﾐﾔｻﾞｷｹﾝ","ﾆｼﾓﾛｶﾀｸﾞﾝﾀｶﾊﾙﾁｮｳ"]
[null,null,"宮崎県","東諸県郡国富町","ﾐﾔｻﾞｷｹﾝ","ﾋｶﾞｼﾓﾛｶﾀｸﾞﾝｸﾆﾄﾐﾁｮｳ"]
[null,null,"宮崎県","東諸県郡綾町","ﾐﾔｻﾞｷｹﾝ","ﾋｶﾞｼﾓﾛｶﾀｸﾞﾝｱﾔﾁｮｳ"]
[null,null,"宮崎県","児湯郡高鍋町","ﾐﾔｻﾞｷｹﾝ","ｺﾕｸﾞﾝﾀｶﾅﾍﾞﾁｮｳ"]
[null,null,"宮崎県","児湯郡新富町","ﾐﾔｻﾞｷｹﾝ","ｺﾕｸﾞﾝｼﾝﾄﾐﾁｮｳ"]
[null,null,"宮崎県","児湯郡西米良村","ﾐﾔｻﾞｷｹﾝ","ｺﾕｸﾞﾝﾆｼﾒﾗｿﾝ"]
[null,null,"宮崎県","児湯郡木城町","ﾐﾔｻﾞｷｹﾝ","ｺﾕｸﾞﾝｷｼﾞｮｳﾁｮｳ"]
[null,null,"宮崎県","児湯郡川南町","ﾐﾔｻﾞｷｹﾝ","ｺﾕｸﾞﾝｶﾜﾐﾅﾐﾁｮｳ"]
[null,null,"宮崎県","児湯郡都農町","ﾐﾔｻﾞｷｹﾝ","ｺﾕｸﾞﾝﾂﾉﾁｮｳ"]
[null,null,"宮崎県","東臼杵郡門川町","ﾐﾔｻﾞｷｹﾝ","ﾋｶﾞｼｳｽｷｸﾞﾝｶﾄﾞｶﾞﾜﾁｮｳ"]
[null,null,"宮崎県","東臼杵郡諸塚村","ﾐﾔｻﾞｷｹﾝ","ﾋｶﾞｼｳｽｷｸﾞﾝﾓﾛﾂｶｿﾝ"]
[null,null,"宮崎県","東臼杵郡椎葉村","ﾐﾔｻﾞｷｹﾝ","ﾋｶﾞｼｳｽｷｸﾞﾝｼｲﾊﾞｿﾝ"]
[null,null,"宮崎県","東臼杵郡美郷町","ﾐﾔｻﾞｷｹﾝ","ﾋｶﾞｼｳｽｷｸﾞﾝﾐｻﾄﾁｮｳ"]
[null,null,"宮崎県","西臼杵郡高千穂町","ﾐﾔｻﾞｷｹﾝ","ﾆｼｳｽｷｸﾞﾝﾀｶﾁﾎﾁｮｳ"]
[null,null,"宮崎県","西臼杵郡日之影町","ﾐﾔｻﾞｷｹﾝ","ﾆｼｳｽｷｸﾞﾝﾋﾉｶｹﾞﾁｮｳ"]
[null,null,"宮崎県","西臼杵郡五ヶ瀬町","ﾐﾔｻﾞｷｹﾝ","ﾆｼｳｽｷｸﾞﾝｺﾞｶｾﾁｮｳ"]
[null,null,"鹿児島県","鹿児島市","ｶｺﾞｼﾏｹﾝ","ｶｺﾞｼﾏｼ"]
[null,null,"鹿児島県","鹿屋市","ｶｺﾞｼﾏｹﾝ","ｶﾉﾔｼ"]
[null,null,"鹿児島県","枕崎市","ｶｺﾞｼﾏｹﾝ","ﾏｸﾗｻﾞｷｼ"]
[null,null,"鹿児島県","阿久根市","ｶｺﾞｼﾏｹﾝ","ｱｸﾈｼ"]
[null,null,"鹿児島県","出水市","ｶｺﾞｼﾏｹﾝ","ｲｽﾞﾐｼ"]
[null,null,"鹿児島県","指宿市","ｶｺﾞｼﾏｹﾝ","ｲﾌﾞｽｷｼ"]
[null,null,"鹿児島県","西之表市","ｶｺﾞｼﾏｹﾝ","ﾆｼﾉｵﾓﾃｼ"]
[null,null,"鹿児島県","垂水市","ｶｺﾞｼﾏｹﾝ","ﾀﾙﾐｽﾞｼ"]
[null,null,"鹿児島県","薩摩川内市","ｶｺﾞｼﾏｹﾝ","ｻﾂﾏｾﾝﾀﾞｲｼ"]
[null,null,"鹿児島県","日置市","ｶｺﾞｼﾏｹﾝ","ﾋｵｷｼ"]
[null,null,"鹿児島県","曽於市","ｶｺﾞｼﾏｹﾝ","ｿｵｼ"]
[null,null,"鹿児島県","霧島市","ｶｺﾞｼﾏｹﾝ","ｷﾘｼﾏｼ"]
[null,null,"鹿児島県","いちき串木野市","ｶｺﾞｼﾏｹﾝ","ｲﾁｷｸｼｷﾉｼ"]
[null,null,"鹿児島県","南さつま市","ｶｺﾞｼﾏｹﾝ","ﾐﾅﾐｻﾂﾏｼ"]
[null,null,"鹿児島県","志布志市","ｶｺﾞｼﾏｹﾝ","ｼﾌﾞｼｼ"]
[null,null,"鹿児島県","奄美市","ｶｺﾞｼﾏｹﾝ","ｱﾏﾐｼ"]
[null,null,"鹿児島県","南九州市","ｶｺﾞｼﾏｹﾝ","ﾐﾅﾐｷｭｳｼｭｳｼ"]
[null,null,"鹿児島県","伊佐市","ｶｺﾞｼﾏｹﾝ","ｲｻｼ"]
[null,null,"鹿児島県","姶良市","ｶｺﾞｼﾏｹﾝ","ｱｲﾗｼ"]
[null,null,"鹿児島県","鹿児島郡三島村","ｶｺﾞｼﾏｹﾝ","ｶｺﾞｼﾏｸﾞﾝﾐｼﾏﾑﾗ"]
[null,null,"鹿児島県","鹿児島郡十島村","ｶｺﾞｼﾏｹﾝ","ｶｺﾞｼﾏｸﾞﾝﾄｼﾏﾑﾗ"]
[null,null,"鹿児島県","薩摩郡さつま町","ｶｺﾞｼﾏｹﾝ","ｻﾂﾏｸﾞﾝｻﾂﾏﾁｮｳ"]
[null,null,"鹿児島県","出水郡長島町","ｶｺﾞｼﾏｹﾝ","ｲｽﾞﾐｸﾞﾝﾅｶﾞｼﾏﾁｮｳ"]
[null,null,"鹿児島県","姶良郡湧水町","ｶｺﾞｼﾏｹﾝ","ｱｲﾗｸﾞﾝﾕｳｽｲﾁｮｳ"]
[null,null,"鹿児島県","曽於郡大崎町","ｶｺﾞｼﾏｹﾝ","ｿｵｸﾞﾝｵｵｻｷﾁｮｳ"]
[null,null,"鹿児島県","肝属郡東串良町","ｶｺﾞｼﾏｹﾝ","ｷﾓﾂｷｸﾞﾝﾋｶﾞｼｸｼﾗﾁｮｳ"]
[null,null,"鹿児島県","肝属郡錦江町","ｶｺﾞｼﾏｹﾝ","ｷﾓﾂｷｸﾞﾝｷﾝｺｳﾁｮｳ"]
[null,null,"鹿児島県","肝属郡南大隅町","ｶｺﾞｼﾏｹﾝ","ｷﾓﾂｷｸﾞﾝﾐﾅﾐｵｵｽﾐﾁｮｳ"]
[null,null,"鹿児島県","肝属郡肝付町","ｶｺﾞｼﾏｹﾝ","ｷﾓﾂｷｸﾞﾝｷﾓﾂｷﾁｮｳ"]
[null,null,"鹿児島県","熊毛郡中種子町","ｶｺﾞｼﾏｹﾝ","ｸﾏｹﾞｸﾞﾝﾅｶﾀﾈﾁｮｳ"]
[null,null,"鹿児島県","熊毛郡南種子町","ｶｺﾞｼﾏｹﾝ","ｸﾏｹﾞｸﾞﾝﾐﾅﾐﾀﾈﾁｮｳ"]
[null,null,"鹿児島県","熊毛郡屋久島町","ｶｺﾞｼﾏｹﾝ","ｸﾏｹﾞｸﾞﾝﾔｸｼﾏﾁｮｳ"]
[null,null,"鹿児島県","大島郡大和村","ｶｺﾞｼﾏｹﾝ","ｵｵｼﾏｸﾞﾝﾔﾏﾄｿﾝ"]
[null,null,"鹿児島県","大島郡宇検村","ｶｺﾞｼﾏｹﾝ","ｵｵｼﾏｸﾞﾝｳｹﾝｿﾝ"]
[null,null,"鹿児島県","大島郡瀬戸内町","ｶｺﾞｼﾏｹﾝ","ｵｵｼﾏｸﾞﾝｾﾄｳﾁﾁｮｳ"]
[null,null,"鹿児島県","大島郡龍郷町","ｶｺﾞｼﾏｹﾝ","ｵｵｼﾏｸﾞﾝﾀﾂｺﾞｳﾁｮｳ"]
[null,null,"鹿児島県","大島郡喜界町","ｶｺﾞｼﾏｹﾝ","ｵｵｼﾏｸﾞﾝｷｶｲﾁｮｳ"]
[null,null,"鹿児島県","大島郡徳之島町","ｶｺﾞｼﾏｹﾝ","ｵｵｼﾏｸﾞﾝﾄｸﾉｼﾏﾁｮｳ"]
[null,null,"鹿児島県","大島郡天城町","ｶｺﾞｼﾏｹﾝ","ｵｵｼﾏｸﾞﾝｱﾏｷﾞﾁｮｳ"]
[null,null,"鹿児島県","大島郡伊仙町","ｶｺﾞｼﾏｹﾝ","ｵｵｼﾏｸﾞﾝｲｾﾝﾁｮｳ"]
[null,null,"鹿児島県","大島郡和泊町","ｶｺﾞｼﾏｹﾝ","ｵｵｼﾏｸﾞﾝﾜﾄﾞﾏﾘﾁｮｳ"]
[null,null,"鹿児島県","大島郡知名町","ｶｺﾞｼﾏｹﾝ","ｵｵｼﾏｸﾞﾝﾁﾅﾁｮｳ"]
[null,null,"鹿児島県","大島郡与論町","ｶｺﾞｼﾏｹﾝ","ｵｵｼﾏｸﾞﾝﾖﾛﾝﾁｮｳ"]
[null,null,"沖縄県","那覇市","ｵｷﾅﾜｹﾝ","ﾅﾊｼ"]
[null,null,"沖縄県","宜野湾市","ｵｷﾅﾜｹﾝ","ｷﾞﾉﾜﾝｼ"]
[null,null,"沖縄県","石垣市","ｵｷﾅﾜｹﾝ","ｲｼｶﾞｷｼ"]
[null,null,"沖縄県","浦添市","ｵｷﾅﾜｹﾝ","ｳﾗｿｴｼ"]
[null,null,"沖縄県","名護市","ｵｷﾅﾜｹﾝ","ﾅｺﾞｼ"]
[null,null,"沖縄県","糸満市","ｵｷﾅﾜｹﾝ","ｲﾄﾏﾝｼ"]
[null,null,"沖縄県","沖縄市","ｵｷﾅﾜｹﾝ","ｵｷﾅﾜｼ"]
[null,null,"沖縄県","豊見城市","ｵｷﾅﾜｹﾝ","ﾄﾐｸﾞｽｸｼ"]
[null,null,"沖縄県","うるま市","ｵｷﾅﾜｹﾝ","ｳﾙﾏｼ"]
[null,null,"沖縄県","宮古島市","ｵｷﾅﾜｹﾝ","ﾐﾔｺｼﾞﾏｼ"]
[null,null,"沖縄県","南城市","ｵｷﾅﾜｹﾝ","ﾅﾝｼﾞｮｳｼ"]
[null,null,"沖縄県","国頭郡国頭村","ｵｷﾅﾜｹﾝ","ｸﾆｶﾞﾐｸﾞﾝｸﾆｶﾞﾐｿﾝ"]
[null,null,"沖縄県","国頭郡大宜味村","ｵｷﾅﾜｹﾝ","ｸﾆｶﾞﾐｸﾞﾝｵｵｷﾞﾐｿﾝ"]
[null,null,"沖縄県","国頭郡東村","ｵｷﾅﾜｹﾝ","ｸﾆｶﾞﾐｸﾞﾝﾋｶﾞｼｿﾝ"]
[null,null,"沖縄県","国頭郡今帰仁村","ｵｷﾅﾜｹﾝ","ｸﾆｶﾞﾐｸﾞﾝﾅｷｼﾞﾝｿﾝ"]
[null,null,"沖縄県","国頭郡本部町","ｵｷﾅﾜｹﾝ","ｸﾆｶﾞﾐｸﾞﾝﾓﾄﾌﾞﾁｮｳ"]
[null,null,"沖縄県","国頭郡恩納村","ｵｷﾅﾜｹﾝ","ｸﾆｶﾞﾐｸﾞﾝｵﾝﾅｿﾝ"]
[null,null,"沖縄県","国頭郡宜野座村","ｵｷﾅﾜｹﾝ","ｸﾆｶﾞﾐｸﾞﾝｷﾞﾉｻﾞｿﾝ"]
[null,null,"沖縄県","国頭郡金武町","ｵｷﾅﾜｹﾝ","ｸﾆｶﾞﾐｸﾞﾝｷﾝﾁｮｳ"]
[null,null,"沖縄県","国頭郡伊江村","ｵｷﾅﾜｹﾝ","ｸﾆｶﾞﾐｸﾞﾝｲｴｿﾝ"]
[null,null,"沖縄県","中頭郡読谷村","ｵｷﾅﾜｹﾝ","ﾅｶｶﾞﾐｸﾞﾝﾖﾐﾀﾝｿﾝ"]
[null,null,"沖縄県","中頭郡嘉手納町","ｵｷﾅﾜｹﾝ","ﾅｶｶﾞﾐｸﾞﾝｶﾃﾞﾅﾁｮｳ"]
[null,null,"沖縄県","中頭郡北谷町","ｵｷﾅﾜｹﾝ","ﾅｶｶﾞﾐｸﾞﾝﾁｬﾀﾝﾁｮｳ"]
[null,null,"沖縄県","中頭郡北中城村","ｵｷﾅﾜｹﾝ","ﾅｶｶﾞﾐｸﾞﾝｷﾀﾅｶｸﾞｽｸｿﾝ"]
[null,null,"沖縄県","中頭郡中城村","ｵｷﾅﾜｹﾝ","ﾅｶｶﾞﾐｸﾞﾝﾅｶｸﾞｽｸｿﾝ"]
[null,null,"沖縄県","中頭郡西原町","ｵｷﾅﾜｹﾝ","ﾅｶｶﾞﾐｸﾞﾝﾆｼﾊﾗﾁｮｳ"]
[null,null,"沖縄県","島尻郡与那原町","ｵｷﾅﾜｹﾝ","ｼﾏｼﾞﾘｸﾞﾝﾖﾅﾊﾞﾙﾁｮｳ"]
[null,null,"沖縄県","島尻郡南風原町","ｵｷﾅﾜｹﾝ","ｼﾏｼﾞﾘｸﾞﾝﾊｴﾊﾞﾙﾁｮｳ"]
[null,null,"沖縄県","島尻郡渡嘉敷村","ｵｷﾅﾜｹﾝ","ｼﾏｼﾞﾘｸﾞﾝﾄｶｼｷｿﾝ"]
[null,null,"沖縄県","島尻郡座間味村","ｵｷﾅﾜｹﾝ","ｼﾏｼﾞﾘｸﾞﾝｻﾞﾏﾐｿﾝ"]
[null,null,"沖縄県","島尻郡粟国村","ｵｷﾅﾜｹﾝ","ｼﾏｼﾞﾘｸﾞﾝｱｸﾞﾆｿﾝ"]
[null,null,"沖縄県","島尻郡渡名喜村","ｵｷﾅﾜｹﾝ","ｼﾏｼﾞﾘｸﾞﾝﾄﾅｷｿﾝ"]
[null,null,"沖縄県","島尻郡南大東村","ｵｷﾅﾜｹﾝ","ｼﾏｼﾞﾘｸﾞﾝﾐﾅﾐﾀﾞｲﾄｳｿﾝ"]
[null,null,"沖縄県","島尻郡北大東村","ｵｷﾅﾜｹﾝ","ｼﾏｼﾞﾘｸﾞﾝｷﾀﾀﾞｲﾄｳｿﾝ"]
[null,null,"沖縄県","島尻郡伊平屋村","ｵｷﾅﾜｹﾝ","ｼﾏｼﾞﾘｸﾞﾝｲﾍﾔｿﾝ"]
[null,null,"沖縄県","島尻郡伊是名村","ｵｷﾅﾜｹﾝ","ｼﾏｼﾞﾘｸﾞﾝｲｾﾞﾅｿﾝ"]
[null,null,"沖縄県","島尻郡久米島町","ｵｷﾅﾜｹﾝ","ｼﾏｼﾞﾘｸﾞﾝｸﾒｼﾞﾏﾁｮｳ"]
[null,null,"沖縄県","島尻郡八重瀬町","ｵｷﾅﾜｹﾝ","ｼﾏｼﾞﾘｸﾞﾝﾔｴｾﾁｮｳ"]
[null,null,"沖縄県","宮古郡多良間村","ｵｷﾅﾜｹﾝ","ﾐﾔｺｸﾞﾝﾀﾗﾏｿﾝ"]
[null,null,"沖縄県","八重山郡竹富町","ｵｷﾅﾜｹﾝ","ﾔｴﾔﾏｸﾞﾝﾀｹﾄﾐﾁｮｳ"]
[null,null,"沖縄県","八重山郡与那国町","ｵｷﾅﾜｹﾝ","ﾔｴﾔﾏｸﾞﾝﾖﾅｸﾞﾆﾁｮｳ"]